{"text_format":"1","workbook":"xlsx","n_sheets":4,"sheets":["Spieler","Gruppen","Matches","Finals"],"not_rendered":{"charts":0,"images":3,"macros":1,"external_links":0,"defined_names":1,"comments":0,"pivot_tables":0},"unopened":[],"bounds":{"document_bytes":16777216,"sheet_cells":100000,"rows_first":2000,"rows_last":500,"rows_between":2000,"halvings":0,"cell_chars":16384,"cell_head_chars":4096},"cells_cut":0,"cells_raw":0,"read":"whole","date_system":"1900"}

{"sheet":"Spieler","index":0,"n_rows":47,"n_cols":14,"rows_kept":47,"cut":false,"hidden":false,"merged":[[17,0,17,3],[6,6,6,8],[6,10,6,12],[0,6,0,7],[1,6,1,13],[2,9,2,10],[3,9,3,10],[4,9,4,10]]}
["   ","Spieler","Gemeldet","Startgeld 20€+15€",null,null,"Century Jackpot:",null,89]
[1,"Marec Stachly","ok",null,{"$f":"IF(B2=\"\",0,IF(D2=\"X\",5000016,RAND()*1000*20))","v":13810.949540095242},null,"Jackpotberechnung"]
[2,"Felix Kirsten","ok",null,{"$f":"IF(B3=\"\",0,IF(D3=\"X\",5000014,RAND()*1000*20))","v":9056.8340812337265},"Aktualisierung:","10.09.2022 - 15:10 Uhr",null,null,"Jackpotsumme:",null,414.5,{"$f":"L3*N3","v":82.9},0.2]
[3,"Marco Weber","ok",null,{"$f":"IF(B4=\"\",0,IF(D4=\"X\",5000013,RAND()*1000*20))","v":13028.220324317952},null,null,null,null,"Startgeld Champions Cup:",null,20,{"$f":"L4*16","v":320}]
[4,"Tino Delling","ok",null,{"$f":"IF(B5=\"\",0,IF(D5=\"X\",5000008,RAND()*1000*20))","v":11538.431563845294},null,null,null,null,"Champion Cup 20%:",null,{"$f":"L3-M3","v":331.6},{"$f":"SUM(M3:M4)","v":402.9}]
[5,"Gustav Hollnagel","ok",null,{"$f":"IF(B6=\"\",0,IF(D6=\"X\",5000006,RAND()*1000*20))","v":11654.444565908054}]
[6,"Joel Fandrei","ok",null,{"$f":"IF(B7=\"\",0,IF(D7=\"X\",5000003,RAND()*1000*20))","v":17654.609900005886},null,"Gesamtjackpot",null,null,null,"Champions Cup"]
[7,"Marko Straßburger","ok",null,{"$f":"IF(B8=\"\",0,IF(D8=\"X\",5000007,RAND()*1000*20))","v":10502.191341906138},null,1,0.19,{"$f":"$L$5*H8","v":63.004000000000005},"Marec Stachly","Platz 1",0.35,{"$f":"$M$5*L8","v":141.01499999999999}]
[8,"Moritz Thomas","ok",null,{"$f":"IF(B9=\"\",0,IF(D9=\"X\",5000015,RAND()*1000*20))","v":18068.367912245678},null,2,0.15,{"$f":"$L$5*H9","v":49.74},"Felix Kirsten","Platz 2",0.2,{"$f":"$M$5*L9","v":80.58}]
[9,"Magnus Suttner","ok",null,{"$f":"IF(B10=\"\",0,IF(D10=\"X\",5000011,RAND()*1000*20))","v":3823.7041508946495},null,3,0.12,39.792000000000002,"Marco Weber","Platz 3",0.15,{"$f":"$M$5*L10","v":60.434999999999995}]
[10,"Max Weber","ok",null,{"$f":"IF(B11=\"\",0,IF(D11=\"X\",5000001,RAND()*1000*20))","v":14723.232897146334},null,4,0.1,33.160000000000004,"Tino Delling","Platz 4",0.1,40.29]
[11,"Andreas Fandrei","ok",null,{"$f":"IF(B12=\"\",0,IF(D12=\"X\",5000017,RAND()*1000*20))","v":19679.32135371631},null,5,0.06,19.896000000000001,"David Gärtner","Platz 5",0.05,20.145]
[12,"Paul Jeroch","ok",null,{"$f":"IF(B13=\"\",0,IF(D13=\"X\",5000010,RAND()*1000*20))","v":19759.622122414778},null,6,0.06,19.896000000000001,"Joel Fandrei","Platz 6",0.05,20.145]
[13,"Marcus Müller","ok",null,{"$f":"IF(B14=\"\",0,IF(D14=\"X\",5000005,RAND()*1000*20))","v":9651.1880201880304},null,7,0.06,19.896000000000001,"Marko Straßburger","Platz 7",0.05,20.145]
[14,"Andreas Hartung","ok",null,{"$f":"IF(B15=\"\",0,IF(D15=\"X\",5000019,RAND()*1000*20))","v":18812.65716249757},null,8,0.06,19.896000000000001,"Moritz Thomas","Platz 8",0.05,20.145]
[15,"Ronny Rejke","ok",null,{"$f":"IF(B16=\"\",0,IF(D16=\"X\",5000012,RAND()*1000*20))","v":7832.8410725341218},null,9,0.03,9.9480000000000004,"Magnus Suttner"]
[16,"Ali Kirim","ok",null,{"$f":"IF(B17=\"\",0,IF(D17=\"X\",5000018,RAND()*1000*20))","v":17177.141445058154},null,10,0.03,9.9480000000000004,"Max Weber","Prüfsumme:",{"$f":"SUM(L8:L15)","v":1.0000000000000002},{"$f":"SUM(M8:M15)","v":402.89999999999992}]
["Wer sich nicht rechtzeitig anmeldet, verliert seinen Startplatz!",null,null,null,null,null,11,0.03,9.9480000000000004,"Andreas Fandrei"]
[null,"Nachrücker",null,null,null,null,12,0.03,9.9480000000000004,"Muhammad Umer"]
[17,"Christian Gabriel",null,null,null,null,13,0.02,6.6320000000000006,"Marcus Müller"]
[18,"Behnam Ahmadi","vorgemerkt",null,null,null,14,0.02,6.6320000000000006,"Andreas Hartung"]
[19,"Gustav Hollnagel","vorgemerkt",null,null,null,15,0.02,6.6320000000000006,"Ronny Rejke"]
[20,"Thomas Fritz",null,null,null,null,16,0.02,6.6320000000000006,"Ali Kirim"]
[21,"Sebastian Lux"]
[22,"Paul Jeroch","vorgemerkt",null,null,null,"Prüfsumme:",{"$f":"SUM(H8:H23)","v":1.0000000000000002},334]
[23,"Michael Kandler",null,null,null,null,"30€ gehen wieder in den Jackpot für die aktuelle Saison."]
[24,"Hans Bergmann"]
[25,"Michael Seidel",null,null,null,null,"Meldeschluss ist der 10.09.2022, 24:00 Uhr!"]
[26,"Ulrich Löffel",null,null,null,null,"Die Nachrücker werden gelost!"]
[27,"Sven Ohlenroth",null,null,null,null,"Jeder Nachrücker zieht sein Los am Turniertag!"]
[28,"Christopher Jaritz","vorgemerkt",null,null,null,"Allen Teilnehmern des Champions Cup sind die Teilnahmebedingungen bekannt und werden akzeptiert!"]
[29,"Stephan Kallies",null,null,null,null,"Nachzulesen:"," https://www.saxonian-snooker.de/3LaenderRanking/3lr-regularien.pdf"]
[30,"Faiz Elham","vorgemerkt"]
[31,"Christopher Buße"]
[32,"Tom Müller"]
[33,"Holger Hänel"]
[34,"Volker Stahl"]
[35,"Andreas Hollin"]
[36,"Stev Karries"]
[37,"Roger Frank"]
[38,"Thomas Metzler"]
[39,"Matthias Bauer"]
[40,"Rene Scheurer"]
[41,"Timo Veit"]
[42,"Frank Rapior"]
[43,"Salvador Valderrama"]
[44,"Johannes Schranz","vorgemerkt"]

{"sheet":"Gruppen","index":1,"n_rows":34,"n_cols":29,"rows_kept":34,"cut":false,"hidden":false,"merged":[[32,19,32,20],[33,19,33,20],[23,19,23,20],[24,19,24,20],[27,0,31,0],[27,19,27,20],[28,19,28,20],[29,19,29,20],[30,19,30,20],[31,19,31,20],[14,19,14,20],[15,19,15,20],[18,0,22,0],[18,19,18,20],[19,19,19,20],[20,19,20,20],[21,19,21,20],[22,19,22,20],[9,0,13,0],[9,19,9,20],[10,19,10,20],[11,19,11,20],[12,19,12,20],[13,19,13,20],[5,19,5,20],[6,19,6,20],[0,0,4,0],[0,19,0,20],[1,19,1,20],[2,19,2,20],[3,19,3,20],[4,19,4,20]]}
["A",null,"Spieler","M","W","L","F+","F-",null,null,null,"Rang","Rang","P+",null,null,null,"Startzeit","Spieler","Spieler",null,"Breaks 30+","F+","F-",null,null,null,null,"Breaks 30+"]
[null,1,{"$f":"VLOOKUP(B2,Spieler!$A$2:$B$17,2,FALSE)","v":"Marec Stachly"},{"$f":"Y2+Y5+Y7","v":3},{"$f":"Z2+Z5+Z7","v":3},{"$f":"AA2+AA5+AA7","v":0},{"$f":"W2+W5+W7","v":6},{"$f":"X2+X5+X7","v":1},null,null,null,{"$f":"IF(C2=\"\",(-90000),(E2*1000)+(G2*100)+D2-(F2*500)-(H2*50)-N2)","v":3553},{"$f":"IF(D2=0,\"\",RANK(L2,L2:L5))","v":1},null,{"$f":"IF(C2=\"\",\"\",C2)","v":"Marec Stachly"},null,1,null,{"$f":"C2","v":"Marec Stachly"},{"$f":"C3","v":"Gustav Hollnagel"},null,null,{"$f":"Matches!E3","v":2},{"$f":"Matches!F3","v":0},{"$f":"IF(OR(W2>X2,X2>W2),1)","v":1},{"$f":"IF(W2>X2,1,0)","v":1},{"$f":"IF(X2>W2,1,0)","v":0}]
[null,5,{"$f":"VLOOKUP(B3,Spieler!$A$2:$B$17,2,FALSE)","v":"Gustav Hollnagel"},{"$f":"Y2+Y4+Y6","v":3},{"$f":"AA2+Z4+Z6","v":0},{"$f":"Z2+AA4+AA6","v":3},{"$f":"X2+W4+W6","v":2},{"$f":"W2+X4+X6","v":6},null,null,null,{"$f":"IF(C3=\"\",(-90000),(E3*1000)+(G3*100)+D3-(F3*500)-(H3*50)-N3)","v":-1597},{"$f":"IF(D3=0,\"\",RANK(L3,L2:L5))","v":4},null,{"$f":"IF(C3=\"\",\"\",C3)","v":"Gustav Hollnagel"},null,2,null,{"$f":"IF(C5=\"\",\"\",C4)","v":"Paul Jeroch"},{"$f":"IF(S3=\"\",\"\",C5)","v":"Ali Kirim"},null,null,{"$f":"Matches!E9","v":1},{"$f":"Matches!F9","v":2},{"$f":"IF(OR(W3>X3,X3>W3),1)","v":1},{"$f":"IF(W3>X3,1,0)","v":0},{"$f":"IF(X3>W3,1,0)","v":1}]
[null,12,{"$f":"VLOOKUP(B4,Spieler!$A$2:$B$17,2,FALSE)","v":"Paul Jeroch"},{"$f":"Y3+Y4+Y7","v":3},{"$f":"Z3+AA4+AA7","v":1},{"$f":"AA3+Z4+Z7","v":2},{"$f":"W3+X4+X7","v":3},{"$f":"X3+W4+W7","v":5},null,null,null,53,{"$f":"IF(D4=0,\"\",RANK(L4,L2:L5))","v":3},null,"Paul Jeroch",null,3,null,{"$f":"T2","v":"Gustav Hollnagel"},{"$f":"C4","v":"Paul Jeroch"},null,null,{"$f":"Matches!E13","v":1},{"$f":"Matches!F13","v":2},1,0,1]
[null,16,{"$f":"VLOOKUP(B5,Spieler!$A$2:$B$17,2,FALSE)","v":"Ali Kirim"},{"$f":"Y3+Y6+Y5","v":3},{"$f":"AA3+AA6+AA5","v":2},{"$f":"Z3+Z6+Z5","v":1},{"$f":"X3+X6+X5","v":5},{"$f":"W3+W6+W5","v":4},null,null,null,1803,{"$f":"IF(D5=0,\"\",RANK(L5,L2:L5))","v":2},null,"Ali Kirim",null,4,null,{"$f":"IF(C5=\"\",\"\",S2)","v":"Marec Stachly"},{"$f":"C5","v":"Ali Kirim"},null,null,{"$f":"Matches!E17","v":2},{"$f":"Matches!F17","v":1},1,1,0]
[null,null,null,null,null,null,null,null,null,null,null,null,null,null,null,null,5,null,{"$f":"IF(C5=\"\",\"\",C3)","v":"Gustav Hollnagel"},{"$f":"IF(S6=\"\",\"\",C5)","v":"Ali Kirim"},null,null,{"$f":"Matches!E20","v":1},{"$f":"Matches!F20","v":2},1,0,1]
[null,null,null,null,null,null,null,null,null,null,null,null,null,null,null,null,6,null,{"$f":"C2","v":"Marec Stachly"},{"$f":"C4","v":"Paul Jeroch"},null,null,{"$f":"Matches!E26","v":2},{"$f":"Matches!F26","v":0},1,1,0]
[]
[]
["B",null,"Spieler","M","W","L","F+","F-",null,null,null,"Rang","Rang","P+",null,null,null,"Startzeit","Spieler","Spieler",null,"Breaks 30+","F+","F-",null,null,null,null,"Breaks 30+"]
[null,2,{"$f":"VLOOKUP(B11,Spieler!$A$2:$B$17,2,FALSE)","v":"Felix Kirsten"},{"$f":"Y11+Y14+Y16","v":3},{"$f":"Z11+Z14+Z16","v":3},{"$f":"AA11+AA14+AA16","v":0},{"$f":"W11+W14+W16","v":6},{"$f":"X11+X14+X16","v":1},null,null,null,{"$f":"IF(C11=\"\",(-90000),(E11*1000)+(G11*100)+D11-(F11*500)-(H11*50)-N11)","v":3553},{"$f":"IF(D11=0,\"\",RANK(L11,L11:L14))","v":1},null,{"$f":"IF(C11=\"\",\"\",C11)","v":"Felix Kirsten"},null,1,null,{"$f":"C11","v":"Felix Kirsten"},{"$f":"C12","v":"Joel Fandrei"},null,null,{"$f":"Matches!E4","v":2},{"$f":"Matches!F4","v":1},{"$f":"IF(OR(W11>X11,X11>W11),1)","v":1},{"$f":"IF(W11>X11,1,0)","v":1},{"$f":"IF(X11>W11,1,0)","v":0}]
[null,6,{"$f":"VLOOKUP(B12,Spieler!$A$2:$B$17,2,FALSE)","v":"Joel Fandrei"},{"$f":"Y11+Y13+Y15","v":3},{"$f":"AA11+Z13+Z15","v":2},{"$f":"Z11+AA13+AA15","v":1},{"$f":"X11+W13+W15","v":5},{"$f":"W11+X13+X15","v":2},null,null,null,{"$f":"IF(C12=\"\",(-90000),(E12*1000)+(G12*100)+D12-(F12*500)-(H12*50)-N12)","v":1903},{"$f":"IF(D12=0,\"\",RANK(L12,L11:L14))","v":2},null,{"$f":"IF(C12=\"\",\"\",C12)","v":"Joel Fandrei"},null,2,null,{"$f":"IF(C14=\"\",\"\",C13)","v":"Andreas Fandrei"},{"$f":"IF(S12=\"\",\"\",C14)","v":"Ronny Rejke"},null,null,{"$f":"Matches!E10","v":2},{"$f":"Matches!F10","v":0},{"$f":"IF(OR(W12>X12,X12>W12),1)","v":1},{"$f":"IF(W12>X12,1,0)","v":1},{"$f":"IF(X12>W12,1,0)","v":0}]
[null,11,{"$f":"VLOOKUP(B13,Spieler!$A$2:$B$17,2,FALSE)","v":"Andreas Fandrei"},{"$f":"Y12+Y13+Y16","v":3},{"$f":"Z12+AA13+AA16","v":1},{"$f":"AA12+Z13+Z16","v":2},{"$f":"W12+X13+X16","v":2},{"$f":"X12+W13+W16","v":4},null,null,null,3,{"$f":"IF(D13=0,\"\",RANK(L13,L11:L14))","v":3},null,"Andreas Fandrei",null,3,null,{"$f":"T11","v":"Joel Fandrei"},{"$f":"C13","v":"Andreas Fandrei"},null,null,{"$f":"Matches!E12","v":2},{"$f":"Matches!F12","v":0},1,1,0]
[null,15,{"$f":"VLOOKUP(B14,Spieler!$A$2:$B$17,2,FALSE)","v":"Ronny Rejke"},{"$f":"Y12+Y15+Y14","v":3},{"$f":"AA12+AA15+AA14","v":0},{"$f":"Z12+Z15+Z14","v":3},{"$f":"X12+X15+X14","v":0},{"$f":"W12+W15+W14","v":6},null,null,null,-1797,{"$f":"IF(D14=0,\"\",RANK(L14,L11:L14))","v":4},null,"Ronny Rejke",null,4,null,{"$f":"IF(C14=\"\",\"\",S11)","v":"Felix Kirsten"},{"$f":"C14","v":"Ronny Rejke"},null,null,{"$f":"Matches!E18","v":2},{"$f":"Matches!F18","v":0},1,1,0]
[null,null,null,null,null,null,null,null,null,null,null,null,null,null,null,null,5,null,{"$f":"IF(C14=\"\",\"\",C12)","v":"Joel Fandrei"},{"$f":"IF(S15=\"\",\"\",C14)","v":"Ronny Rejke"},null,null,{"$f":"Matches!E19","v":2},{"$f":"Matches!F19","v":0},1,1,0]
[null,null,null,null,null,null,null,null,null,null,null,null,null,null,null,null,6,null,{"$f":"C11","v":"Felix Kirsten"},{"$f":"C13","v":"Andreas Fandrei"},null,null,{"$f":"Matches!E25","v":2},{"$f":"Matches!F25","v":0},1,1,0]
[]
[]
["C",null,"Spieler","M","W","L","F+","F-",null,null,null,"Rang","Rang","P+",null,null,null,"Startzeit","Spieler","Spieler",null,"Breaks 30+","F+","F-",null,null,null,null,"Breaks 30+"]
[null,3,{"$f":"VLOOKUP(B20,Spieler!$A$2:$B$17,2,FALSE)","v":"Marco Weber"},{"$f":"Y20+Y23+Y25","v":3},{"$f":"Z20+Z23+Z25","v":2},{"$f":"AA20+AA23+AA25","v":1},{"$f":"W20+W23+W25","v":5},{"$f":"X20+X23+X25","v":2},null,null,null,{"$f":"IF(C20=\"\",(-90000),(E20*1000)+(G20*100)+D20-(F20*500)-(H20*50)-N20)","v":1903},{"$f":"IF(D20=0,\"\",RANK(L20,L20:L23))","v":2},null,{"$f":"IF(C20=\"\",\"\",C20)","v":"Marco Weber"},null,1,null,{"$f":"C20","v":"Marco Weber"},{"$f":"C21","v":"Marko Straßburger"},null,null,{"$f":"Matches!E7","v":2},{"$f":"Matches!F7","v":0},{"$f":"IF(OR(W20>X20,X20>W20),1)","v":1},{"$f":"IF(W20>X20,1,0)","v":1},{"$f":"IF(X20>W20,1,0)","v":0}]
[null,7,{"$f":"VLOOKUP(B21,Spieler!$A$2:$B$17,2,FALSE)","v":"Marko Straßburger"},{"$f":"Y20+Y22+Y24","v":3},{"$f":"AA20+Z22+Z24","v":0},{"$f":"Z20+AA22+AA24","v":3},{"$f":"X20+W22+W24","v":1},{"$f":"W20+X22+X24","v":6},null,null,null,{"$f":"IF(C21=\"\",(-90000),(E21*1000)+(G21*100)+D21-(F21*500)-(H21*50)-N21)","v":-1697},{"$f":"IF(D21=0,\"\",RANK(L21,L20:L23))","v":4},null,{"$f":"IF(C21=\"\",\"\",C21)","v":"Marko Straßburger"},null,2,null,{"$f":"IF(C23=\"\",\"\",C22)","v":"Max Weber"},{"$f":"IF(S21=\"\",\"\",C23)","v":"Andreas Hartung"},null,null,{"$f":"Matches!E5","v":2},{"$f":"Matches!F5","v":1},{"$f":"IF(OR(W21>X21,X21>W21),1)","v":1},{"$f":"IF(W21>X21,1,0)","v":1},{"$f":"IF(X21>W21,1,0)","v":0}]
[null,10,{"$f":"VLOOKUP(B22,Spieler!$A$2:$B$17,2,FALSE)","v":"Max Weber"},{"$f":"Y21+Y22+Y25","v":3},{"$f":"Z21+AA22+AA25","v":3},{"$f":"AA21+Z22+Z25","v":0},{"$f":"W21+X22+X25","v":6},{"$f":"X21+W22+W25","v":2},null,null,null,3503,{"$f":"IF(D22=0,\"\",RANK(L22,L20:L23))","v":1},null,"Max Weber",null,3,null,{"$f":"T20","v":"Marko Straßburger"},{"$f":"C22","v":"Max Weber"},null,null,{"$f":"Matches!E11","v":0},{"$f":"Matches!F11","v":2},1,0,1]
[null,14,{"$f":"VLOOKUP(B23,Spieler!$A$2:$B$17,2,FALSE)","v":"Andreas Hartung"},{"$f":"Y21+Y24+Y23","v":3},{"$f":"AA21+AA24+AA23","v":1},{"$f":"Z21+Z24+Z23","v":2},{"$f":"X21+X24+X23","v":3},{"$f":"W21+W24+W23","v":5},null,null,null,53,{"$f":"IF(D23=0,\"\",RANK(L23,L20:L23))","v":3},null,"Andreas Hartung",null,4,null,{"$f":"IF(C23=\"\",\"\",S20)","v":"Marco Weber"},{"$f":"C23","v":"Andreas Hartung"},null,null,{"$f":"Matches!E16","v":2},{"$f":"Matches!F16","v":0},1,1,0]
[null,null,null,null,null,null,null,null,null,null,null,null,null,null,null,null,5,null,{"$f":"IF(C23=\"\",\"\",C21)","v":"Marko Straßburger"},{"$f":"IF(S24=\"\",\"\",C23)","v":"Andreas Hartung"},null,null,{"$f":"Matches!E22","v":1},{"$f":"Matches!F22","v":2},1,0,1]
[null,null,null,null,null,null,null,null,null,null,null,null,null,null,null,null,6,null,{"$f":"C20","v":"Marco Weber"},{"$f":"C22","v":"Max Weber"},null,null,{"$f":"Matches!E23","v":1},{"$f":"Matches!F23","v":2},1,0,1]
[]
[]
["D",null,"Spieler","M","W","L","F+","F-",null,null,null,"Rang","Rang","P+",null,null,null,"Startzeit","Spieler","Spieler",null,"Breaks 30+","F+","F-",null,null,null,null,"Breaks 30+"]
[null,4,{"$f":"VLOOKUP(B29,Spieler!$A$2:$B$17,2,FALSE)","v":"Tino Delling"},{"$f":"Y29+Y32+Y34","v":3},{"$f":"Z29+Z32+Z34","v":1},{"$f":"AA29+AA32+AA34","v":2},{"$f":"W29+W32+W34","v":2},{"$f":"X29+X32+X34","v":4},null,null,null,{"$f":"IF(C29=\"\",(-90000),(E29*1000)+(G29*100)+D29-(F29*500)-(H29*50)-N29)","v":3},{"$f":"IF(D29=0,\"\",RANK(L29,L29:L32))","v":3},null,{"$f":"IF(C29=\"\",\"\",C29)","v":"Tino Delling"},null,1,null,{"$f":"C29","v":"Tino Delling"},{"$f":"C30","v":"Moritz Thomas"},null,null,{"$f":"Matches!E8","v":0},{"$f":"Matches!F8","v":2},{"$f":"IF(OR(W29>X29,X29>W29),1)","v":1},{"$f":"IF(W29>X29,1,0)","v":0},{"$f":"IF(X29>W29,1,0)","v":1}]
[null,8,{"$f":"VLOOKUP(B30,Spieler!$A$2:$B$17,2,FALSE)","v":"Moritz Thomas"},{"$f":"Y29+Y31+Y33","v":3},{"$f":"AA29+Z31+Z33","v":2},{"$f":"Z29+AA31+AA33","v":1},{"$f":"X29+W31+W33","v":4},{"$f":"W29+X31+X33","v":2},null,null,null,{"$f":"IF(C30=\"\",(-90000),(E30*1000)+(G30*100)+D30-(F30*500)-(H30*50)-N30)","v":1803},{"$f":"IF(D30=0,\"\",RANK(L30,L29:L32))","v":2},null,{"$f":"IF(C30=\"\",\"\",C30)","v":"Moritz Thomas"},null,2,null,{"$f":"IF(C32=\"\",\"\",C31)","v":"Magnus Suttner"},{"$f":"IF(S30=\"\",\"\",C32)","v":"Marcus Müller"},null,null,{"$f":"Matches!E6","v":2},{"$f":"Matches!F6","v":0},{"$f":"IF(OR(W30>X30,X30>W30),1)","v":1},{"$f":"IF(W30>X30,1,0)","v":1},{"$f":"IF(X30>W30,1,0)","v":0}]
[null,9,{"$f":"VLOOKUP(B31,Spieler!$A$2:$B$17,2,FALSE)","v":"Magnus Suttner"},{"$f":"Y30+Y31+Y34","v":3},{"$f":"Z30+AA31+AA34","v":3},{"$f":"AA30+Z31+Z34","v":0},{"$f":"W30+X31+X34","v":6},{"$f":"X30+W31+W34","v":0},null,null,null,3603,{"$f":"IF(D31=0,\"\",RANK(L31,L29:L32))","v":1},null,"Magnus Suttner",null,3,null,{"$f":"T29","v":"Moritz Thomas"},{"$f":"C31","v":"Magnus Suttner"},null,null,{"$f":"Matches!E14","v":0},{"$f":"Matches!F14","v":2},1,0,1]
[null,13,{"$f":"VLOOKUP(B32,Spieler!$A$2:$B$17,2,FALSE)","v":"Marcus Müller"},{"$f":"Y30+Y33+Y32","v":3},{"$f":"AA30+AA33+AA32","v":0},{"$f":"Z30+Z33+Z32","v":3},{"$f":"X30+X33+X32","v":0},{"$f":"W30+W33+W32","v":6},null,null,null,-1797,{"$f":"IF(D32=0,\"\",RANK(L32,L29:L32))","v":4},null,"Marcus Müller",null,4,null,{"$f":"IF(C32=\"\",\"\",S29)","v":"Tino Delling"},{"$f":"C32","v":"Marcus Müller"},null,null,{"$f":"Matches!E15","v":2},{"$f":"Matches!F15","v":0},1,1,0]
[null,null,null,null,null,null,null,null,null,null,null,null,null,null,null,null,5,null,{"$f":"IF(C32=\"\",\"\",C30)","v":"Moritz Thomas"},{"$f":"IF(S33=\"\",\"\",C32)","v":"Marcus Müller"},null,null,{"$f":"Matches!E21","v":2},{"$f":"Matches!F21","v":0},1,1,0]
[null,null,null,null,null,null,null,null,null,null,null,null,null,null,null,null,6,null,{"$f":"C29","v":"Tino Delling"},{"$f":"C31","v":"Magnus Suttner"},null,null,{"$f":"Matches!E24","v":0},{"$f":"Matches!F24","v":2},1,0,1]

{"sheet":"Matches","index":2,"n_rows":26,"n_cols":9,"rows_kept":26,"cut":false,"hidden":false,"merged":[[0,0,0,8]]}
["Ansetzungen Champions Cup 2022"]
[null,"Nr.","Startzeit","Spieler ","F+","F-","Spieler","Break 30+ Sp1","Break 30+ Sp2"]
["Tisch",1,"10:00:00",{"$f":"Gruppen!S2","v":"Marec Stachly"},2,0,{"$f":"Gruppen!T2","v":"Gustav Hollnagel"}]
["Tisch",4,"10:00:00",{"$f":"Gruppen!S11","v":"Felix Kirsten"},2,1,{"$f":"Gruppen!T11","v":"Joel Fandrei"},40.36,69]
["Tisch",2,"10:00:00",{"$f":"Gruppen!S21","v":"Max Weber"},2,1,{"$f":"Gruppen!T21","v":"Andreas Hartung"}]
["Tisch",3,"10:00:00",{"$f":"Gruppen!S30","v":"Magnus Suttner"},2,0,{"$f":"Gruppen!T30","v":"Marcus Müller"}]
["Tisch",1,"11:11:00",{"$f":"Gruppen!S20","v":"Marco Weber"},2,0,{"$f":"Gruppen!T20","v":"Marko Straßburger"}]
["Tisch",4,"11:11:00",{"$f":"Gruppen!S29","v":"Tino Delling"},0,2,{"$f":"Gruppen!T29","v":"Moritz Thomas"},null,46]
["Tisch",2,"11:26:00",{"$f":"Gruppen!S3","v":"Paul Jeroch"},1,2,{"$f":"Gruppen!T3","v":"Ali Kirim"}]
["Tisch",3,"11:11:00",{"$f":"Gruppen!S12","v":"Andreas Fandrei"},2,0,{"$f":"Gruppen!T12","v":"Ronny Rejke"}]
["Tisch",1,"11:47:00",{"$f":"Gruppen!S22","v":"Marko Straßburger"},0,2,{"$f":"Gruppen!T22","v":"Max Weber"}]
["Tisch",4,"!!",{"$f":"Gruppen!S13","v":"Joel Fandrei"},2,0,{"$f":"Gruppen!T13","v":"Andreas Fandrei"}]
["Tisch",2,"12:40:00",{"$f":"Gruppen!S4","v":"Gustav Hollnagel"},1,2,{"$f":"Gruppen!T4","v":"Paul Jeroch"}]
["Tisch",3,"12:22:00",{"$f":"Gruppen!S31","v":"Moritz Thomas"},0,2,{"$f":"Gruppen!T31","v":"Magnus Suttner"},33,37]
["Tisch",1,"12:54:00",{"$f":"Gruppen!S32","v":"Tino Delling"},2,0,{"$f":"Gruppen!T32","v":"Marcus Müller"}]
["Tisch",4,"13:24:00",{"$f":"Gruppen!S23","v":"Marco Weber"},2,0,{"$f":"Gruppen!T23","v":"Andreas Hartung"}]
["Tisch",2,"13:39:00",{"$f":"Gruppen!S5","v":"Marec Stachly"},2,1,{"$f":"Gruppen!T5","v":"Ali Kirim"},36]
["Tisch",3,"12:25:00",{"$f":"Gruppen!S14","v":"Felix Kirsten"},2,0,{"$f":"Gruppen!T14","v":"Ronny Rejke"}]
["Tisch",1,"13:40:00",{"$f":"Gruppen!S15","v":"Joel Fandrei"},2,0,{"$f":"Gruppen!T15","v":"Ronny Rejke"},55]
["Tisch",4,"15:02:00",{"$f":"Gruppen!S6","v":"Gustav Hollnagel"},1,2,{"$f":"Gruppen!T6","v":"Ali Kirim"}]
["Tisch",2,"13:43:00",{"$f":"Gruppen!S33","v":"Moritz Thomas"},2,0,{"$f":"Gruppen!T33","v":"Marcus Müller"}]
["Tisch",3,"14:22:00",{"$f":"Gruppen!S24","v":"Marko Straßburger"},1,2,{"$f":"Gruppen!T24","v":"Andreas Hartung"}]
["Tisch",1,"14:23:00",{"$f":"Gruppen!S25","v":"Marco Weber"},1,2,{"$f":"Gruppen!T25","v":"Max Weber"},56,34]
["Tisch",4,"14:35:00",{"$f":"Gruppen!S34","v":"Tino Delling"},0,2,{"$f":"Gruppen!T34","v":"Magnus Suttner"}]
["Tisch",2,"15:01:00",{"$f":"Gruppen!S16","v":"Felix Kirsten"},2,0,{"$f":"Gruppen!T16","v":"Andreas Fandrei"},30]
["Tisch",3,"15:08:00",{"$f":"Gruppen!S7","v":"Marec Stachly"},2,0,{"$f":"Gruppen!T7","v":"Paul Jeroch"}]

{"sheet":"Finals","index":3,"n_rows":18,"n_cols":17,"rows_kept":18,"cut":false,"hidden":false,"merged":[[11,4,12,4],[8,9,8,11],[0,1,0,16],[1,15,1,16],[7,4,8,4]]}
[null,"CHAMPIONS CUP - 2022 - Finals"]
[null,"Viertelfinals","Bo5","Break",null,"Halbfinals","Bo5","Break",null,"Finals","Bo7","Break",null,null,null,"Ranking"]
[null,null,null,null,null,null,null,null,null,null,null,null,null,null,null,1,{"$f":"IF($K$10<$K$11,$J$11,IF($K$11<$K$10,$J$10,\"\"))","v":"Felix Kirsten"}]
[null,null,null,null,null,null,null,null,null,null,null,null,null,null,null,2,{"$f":"IF($K$10>$K$11,$J$11,IF($K$11>$K$10,$J$10,\"\"))","v":"Marec Stachly"}]
["A1",{"$f":"IFERROR(VLOOKUP(1,Gruppen!M2:O5,3,FALSE),\"\")","v":"Marec Stachly"},3,null,null,null,null,null,null,null,null,null,null,null,null,3,{"$f":"IF($K$15>$K$16,$J$15,IF($K$16>$K$15,$J$16,\"\"))","v":"Joel Fandrei"}]
["D2",{"$f":"IFERROR(VLOOKUP(2,Gruppen!M29:O32,3,FALSE),\"\")","v":"Moritz Thomas"},0,null,null,null,null,null,null,null,null,null,null,null,null,4,{"$f":"IF($K$15<$K$16,$J$15,IF($K$16<$K$15,$J$16,\"\"))","v":"Magnus Suttner"}]
[null,null,null,null,null,null,null,null,null,null,null,null,null,null,null,5,{"$f":"IF(C5>C6,B6,IF(C6>C5,B5,\"\"))","v":"Moritz Thomas"}]
["C1",{"$f":"IFERROR(VLOOKUP(1,Gruppen!M20:O23,3,FALSE),\"\")","v":"Max Weber"},2,null,"HF1",{"$f":"IF(C5=C6,\"\",IF(C5>C6,B5,B6))","v":"Marec Stachly"},3,59,null,null,null,null,null,null,null,5,{"$f":"IF(C8>C9,B9,IF(C9>C8,B8,\"\"))","v":"Max Weber"}]
["B2",{"$f":"IFERROR(VLOOKUP(2,Gruppen!M11:O14,3,FALSE),\"\")","v":"Joel Fandrei"},3,null,null,{"$f":"IF($C$8=$C$9,\"\",IF($C$8>$C$9,$B$8,$B$9))","v":"Joel Fandrei"},0,36,null,"FINALE CHAMPIONS CUP",null,null,null,"Sieger",null,5,{"$f":"IF(C12>C13,B13,IF(C13>C12,B12,\"\"))","v":"Marco Weber"}]
[null,null,null,null,null,null,null,null,null,{"$f":"IF(G8=G9,\"\",IF(G8>G9,F8,F9))","v":"Marec Stachly"},0,null,null,{"$f":"IF(K10=K11,\"\",IF(K10>K11,J10,J11))","v":"Felix Kirsten"},null,5,{"$f":"IF(C15>C16,B16,IF(C16>C15,B15,\"\"))","v":"Ali Kirim"}]
[null,null,null,null,null,null,null,null,null,{"$f":"IF(G12=G13,\"\",IF(G12>G13,F12,F13))","v":"Felix Kirsten"},3,35.35,null,"Champions Cup Champion",null,9,{"$f":"_xlfn.IFNA(VLOOKUP(3,Gruppen!$M$2:$O$5,3,FALSE),\"\")","v":"Paul Jeroch"}]
["B1",{"$f":"IFERROR(VLOOKUP(1,Gruppen!M11:O14,3,FALSE),\"\")","v":"Felix Kirsten"},3,null,"HF2",{"$f":"IF(C12=C13,\"\",IF(C12>C13,B12,B13))","v":"Felix Kirsten"},3,null,null,null,null,null,null,null,null,9,{"$f":"_xlfn.IFNA(VLOOKUP(3,Gruppen!$M$11:$O$14,3,FALSE),\"\")","v":"Andreas Fandrei"}]
["C2",{"$f":"IFERROR(VLOOKUP(2,Gruppen!M20:O23,3,FALSE),\"\")","v":"Marco Weber"},1,null,null,{"$f":"IF($C$15=$C$16,\"\",IF($C$15>$C$16,$B$15,$B$16))","v":"Magnus Suttner"},1,null,null,null,null,null,null,null,null,9,{"$f":"_xlfn.IFNA(VLOOKUP(3,Gruppen!$M$20:$O$23,3,FALSE),\"\")","v":"Andreas Hartung"}]
[null,null,null,null,null,null,null,null,null,"Spiel um Platz 3","Bo3",null,null,null,null,9,{"$f":"_xlfn.IFNA(VLOOKUP(3,Gruppen!$M$29:$O$32,3,FALSE),\"\")","v":"Tino Delling"}]
["D1",{"$f":"IFERROR(VLOOKUP(1,Gruppen!M29:O32,3,FALSE),\"\")","v":"Magnus Suttner"},3,null,null,null,null,null,null,{"$f":"IF(G8=G9,\"\",IF(G8<G9,F8,F9))","v":"Joel Fandrei"},1,null,null,null,null,13,{"$f":"_xlfn.IFNA(VLOOKUP(4,Gruppen!$M$2:$O$5,3,FALSE),\"\")","v":"Gustav Hollnagel"}]
["A2",{"$f":"IFERROR(VLOOKUP(2,Gruppen!M2:O5,3,FALSE),\"\")","v":"Ali Kirim"},2,null,null,null,null,null,null,{"$f":"IF(G12=G13,\"\",IF(G12<G13,F12,F13))","v":"Magnus Suttner"},0,null,null,null,null,13,{"$f":"_xlfn.IFNA(VLOOKUP(4,Gruppen!$M$11:$O$14,3,FALSE),\"\")","v":"Ronny Rejke"}]
[null,null,null,null,null,null,null,null,null,null,null,null,null,null,null,13,{"$f":"_xlfn.IFNA(VLOOKUP(4,Gruppen!$M$20:$O$23,3,FALSE),\"\")","v":"Marko Straßburger"}]
[null,null,null,null,null,null,null,null,null,null,null,null,null,null,null,13,{"$f":"_xlfn.IFNA(VLOOKUP(4,Gruppen!$M$29:$O$32,3,FALSE),\"\")","v":"Marcus Müller"}]