{"text_format":"1","workbook":"xlsx","n_sheets":6,"sheets":["Spieler","1. Runde Gruppen","Matches","Berechnung","2. Runde Gruppen","Finals"],"not_rendered":{"charts":0,"images":13,"macros":1,"external_links":0,"defined_names":8,"comments":0,"pivot_tables":0},"unopened":[],"bounds":{"document_bytes":16777216,"sheet_cells":100000,"rows_first":2000,"rows_last":500,"rows_between":2000,"halvings":0,"cell_chars":16384,"cell_head_chars":4096},"cells_cut":0,"cells_raw":0,"read":"whole","date_system":"1900"}

{"sheet":"Spieler","index":0,"n_rows":501,"n_cols":44,"rows_kept":501,"cut":false,"hidden":false,"merged":[[11,19,11,26],[4,18,4,26],[25,16,25,18],[9,18,9,26],[10,18,10,26],[13,18,13,19],[18,31,33,31],[1,31,3,31],[5,31,9,31],[1,29,3,29],[5,29,9,29],[18,29,33,29]]}
[null,null,"Spieler","Startgeld","Gesetzt","Los",null,null,{"$f":"AP501","v":0},null,null,null,null,{"$f":"E43","v":0},"von",{"$f":"IFERROR(Z14,0)","v":8},"gesetzte Spieler",{"$f":"IF(I1>P1,1,0)","v":0},null,null,{"$f":"IF(I1>P1,1,0)","v":0},null,null,null,null,null,null,"TN","Gruppen","Gesetzt","Modus R2","TN R2",{"$f":"IF(AB37=FALSE,\"\",\"X\")","v":"X"},"TN","spielt","gesetzt","Spieler","Zufallszahl","GST",null,"gelost",null,"Los",{"$f":"IFERROR(LARGE(AH2:AH500,1),0)","v":24}]
[1,{"$f":"IF(E2=\"\",A2,\"\")","v":1},{"$f":"IFERROR(VLOOKUP(A2,AH2:$AK$500,4,FALSE),\"\")","v":"Behling Oliver"},"ok",{"$f":"IFERROR(VLOOKUP(C2,$AK$2:$AN$500,4,FALSE),\"\")","v":""},{"$f":"IF(OR(C2=\"X\",C2=\"Y\",C2=\"Z\"),0,IF(C2<>\"\",1,0))","v":1},{"$f":"IF(C2<>\"\",1,0)","v":1},{"$f":"IF(E2=\"gesetzt\",C2,\"\")","v":""},"C1",{"$f":"IF(C2>\"\",C2,\"\")","v":"Behling Oliver"},{"$f":"IF(H2>0,1,\"\")","v":1},{"$f":"IF(ROW(H1)>COUNTA(H:H),\"\",INDEX(H:H,SMALL(IF(H$2:H$100<>\"\",ROW($2:$100)),ROW(H1))))","v":{"$error":"#NUM!"}},{"$f":"SMALL($K$2:$K$9,1)","v":1},{"$f":"IFERROR(VLOOKUP(M2,$K$2:$L$9,2,FALSE),\"\")","v":""},{"$f":"IF(AND(AG1=\"X\",S12>18),1,IF(AND(S12>16,S12<24),1,0))","v":1},{"$f":"IF(Q2>\"\",\"A1\",\"\")","v":""},{"$f":"N2","v":""},null,null,null,null,null,null,null,null,null,null,{"$f":"V14","v":8},{"$f":"X14","v":"2x4"},{"$f":"VLOOKUP(AB2,$V$14:$Y$46,4,FALSE)","v":2},"K.O.",4,{"$f":"IF(D2=\"\",\"\",IF(OR(D2=1,D2=\"OK\"),\"X\",IF(D2=2,\"y\")))","v":"X"},{"$f":"IF(AI2<>\"\",COUNTA($AI$2:$AI2),\"\")","v":""},null,null,"Ahmadi Behnam",{"$f":"IFERROR(IF(AI2=\"\",\"\",IF(AJ2=\"gesetzt\",RAND()*5000000,RAND()*1000*20)),\"\")","v":""},"ok",{"$f":"IF(AJ2=\"\",\"\",AJ2)","v":""},{"$f":"Berechnung!CZ2","v":"D1"},{"$f":"IF(AN2=\"gesetzt\",1,0)","v":0},{"$f":"AO2","v":"D1"},"E1"]
[2,{"$f":"IF(E3=\"\",A3,\"\")","v":2},{"$f":"IFERROR(VLOOKUP(A3,AH3:$AK$500,4,FALSE),\"\")","v":"Brachmanski Dave"},"ok","",{"$f":"IF(OR(C3=\"X\",C3=\"Y\",C3=\"Z\"),0,IF(C3<>\"\",1,0))","v":1},{"$f":"IF(C3<>\"\",1,0)","v":1},{"$f":"IF(E3=\"gesetzt\",C3,\"\")","v":""},"A2",{"$f":"IF(C3>\"\",C3,\"\")","v":"Brachmanski Dave"},{"$f":"IF(H3>0,2,\"\")","v":2},{"$f":"IF(ROW(H2)>COUNTA(H:H),\"\",INDEX(H:H,SMALL(IF(H$2:H$100<>\"\",ROW($2:$100)),ROW(H2))))","v":{"$error":"#NUM!"}},{"$f":"SMALL($K$2:$K$9,2)","v":2},{"$f":"IFERROR(VLOOKUP(M3,$K$2:$L$9,2,FALSE),\"\")","v":""},{"$f":"IF(I1=0,0,IF(I1>P1,1,IF(P1>I1,1,0)))","v":0},{"$f":"IF(Q3>\"\",\"B1\",\"\")","v":""},{"$f":"N3","v":""},null,null,null,null,null,null,null,null,null,null,9,{"$f":"X15","v":"1x4 1x5"},null,"K.O.",null,"X",{"$f":"IF(AI3<>\"\",COUNTA($AI$2:$AI3),\"\")","v":""},null,null,"Ahmed Roy Rameez","","ok",{"$f":"IF(AJ3=\"\",\"\",AJ3)","v":""},{"$f":"Berechnung!CZ3","v":"G2"},{"$f":"IF(AN3=\"gesetzt\",1,0)","v":0},"G2","A1"]
[3,{"$f":"IF(E4=\"\",A4,\"\")","v":3},{"$f":"IFERROR(VLOOKUP(A4,AH4:$AK$500,4,FALSE),\"\")","v":"Brömel Frank"},"ok","",1,1,"","B2","Brömel Frank",{"$f":"IF(H4>0,3,\"\")","v":3},{"$f":"IF(ROW(H3)>COUNTA(H:H),\"\",INDEX(H:H,SMALL(IF(H$2:H$100<>\"\",ROW($2:$100)),ROW(H3))))","v":{"$error":"#NUM!"}},{"$f":"SMALL($K$2:$K$9,3)","v":3},"",null,{"$f":"IF(Q4>\"\",\"C1\",\"\")","v":""},"",null,null,null,null,null,null,null,null,null,null,10,"2x5",null,"K.O.",null,"X",{"$f":"IF(AI4<>\"\",COUNTA($AI$2:$AI4),\"\")","v":""},null,null,null,"",null,"",{"$f":"Berechnung!CZ4","v":"A3"},0,"A3","B1"]
[4,4,{"$f":"IFERROR(VLOOKUP(A5,AH5:$AK$500,4,FALSE),\"\")","v":"Delling Tino"},"ok","",1,1,"","E3","Delling Tino",{"$f":"IF(H5>0,4,\"\")","v":4},{"$f":"IF(ROW(H4)>COUNTA(H:H),\"\",INDEX(H:H,SMALL(IF(H$2:H$100<>\"\",ROW($2:$100)),ROW(H4))))","v":{"$error":"#NUM!"}},{"$f":"SMALL($K$2:$K$9,4)","v":4},"",null,{"$f":"IF(Q5>\"\",\"D1\",\"\")","v":""},"",null,null,null,null,null,null,null,null,null,null,11,"1x3 2x4",{"$f":"VLOOKUP(AB5,$V$14:$Y$46,4,FALSE)","v":4},"K.O.",8,"X",{"$f":"IF(AI5<>\"\",COUNTA($AI$2:$AI5),\"\")","v":""},null,null,"Bauer Dennis","",null,"",{"$f":"Berechnung!CZ5","v":"F2"},0,"F2","G1"]
[5,5,{"$f":"IFERROR(VLOOKUP(A6,AH6:$AK$500,4,FALSE),\"\")","v":"Drahn Robert"},"ok","",1,1,"","B1","Drahn Robert",{"$f":"IF(H6>0,5,\"\")","v":5},{"$f":"IF(ROW(H5)>COUNTA(H:H),\"\",INDEX(H:H,SMALL(IF(H$2:H$100<>\"\",ROW($2:$100)),ROW(H5))))","v":{"$error":"#NUM!"}},{"$f":"SMALL($K$2:$K$9,5)","v":5},"",null,{"$f":"IF(Q6>\"\",\"E1\",\"\")","v":""},"",null,null,null,null,null,null,null,null,null,null,12,"4x3",4,"K.O.",8,"X",{"$f":"IF(AI6<>\"\",COUNTA($AI$2:$AI6),\"\")","v":""},null,null,"Bauer Matthias","","ok","",{"$f":"Berechnung!CZ6","v":"H2"},0,"H2","C1"]
[6,6,{"$f":"IFERROR(VLOOKUP(A7,AH7:$AK$500,4,FALSE),\"\")","v":"Elham Faiz"},"ok","",1,1,"","H1","Elham Faiz",{"$f":"IF(H7>0,6,\"\")","v":6},{"$f":"IF(ROW(H6)>COUNTA(H:H),\"\",INDEX(H:H,SMALL(IF(H$2:H$100<>\"\",ROW($2:$100)),ROW(H6))))","v":{"$error":"#NUM!"}},{"$f":"SMALL($K$2:$K$9,6)","v":6},"",null,{"$f":"IF(Q7>\"\",\"F1\",\"\")","v":""},"",null,null,null,null,null,null,null,null,null,null,13,"3x3 1x4",null,"K.O.",null,"X",{"$f":"IF(AI7<>\"\",COUNTA($AI$2:$AI7),\"\")","v":""},null,null,"Beetz Mario","",null,"",{"$f":"Berechnung!CZ7","v":"D3"},0,"D3","F1"]
[7,7,{"$f":"IFERROR(VLOOKUP(A8,AH8:$AK$500,4,FALSE),\"\")","v":"Fandrei Andreas"},"ok","",1,1,"","E2","Fandrei Andreas",{"$f":"IF(H8>0,7,\"\")","v":7},{"$f":"IF(ROW(H7)>COUNTA(H:H),\"\",INDEX(H:H,SMALL(IF(H$2:H$100<>\"\",ROW($2:$100)),ROW(H7))))","v":{"$error":"#NUM!"}},{"$f":"SMALL($K$2:$K$9,7)","v":7},"",null,{"$f":"IF(Q8>\"\",\"G1\",\"\")","v":""},"",null,null,null,null,null,null,null,null,null,null,14,"2x3 2x4",null,"K.O.",null,"X",{"$f":"IF(AI8<>\"\",COUNTA($AI$2:$AI8),\"\")","v":1},"ok",null,"Behling Oliver",16271.340692126782,null,"",{"$f":"Berechnung!CZ8","v":"A2"},0,"A2","H1"]
[8,8,{"$f":"IFERROR(VLOOKUP(A9,AH9:$AK$500,4,FALSE),\"\")","v":"Fandrei Joel"},"ok","",1,1,"","H2","Fandrei Joel",{"$f":"IF(H9>0,8,\"\")","v":8},{"$f":"IF(ROW(H8)>COUNTA(H:H),\"\",INDEX(H:H,SMALL(IF(H$2:H$100<>\"\",ROW($2:$100)),ROW(H8))))","v":{"$error":"#NUM!"}},{"$f":"SMALL($K$2:$K$9,8)","v":8},"",null,{"$f":"IF(Q9>\"\",\"H1\",\"\")","v":""},"",null,null,null,null,null,null,null,null,null,null,15,"1x3 3x4",null,"K.O.",null,"X",{"$f":"IF(AI9<>\"\",COUNTA($AI$2:$AI9),\"\")","v":""},null,null,"Belzl Achim","","ok","",{"$f":"Berechnung!CZ9","v":"E3"},0,"E3","D1"]
[9,9,{"$f":"IFERROR(VLOOKUP(A10,AH10:$AK$500,4,FALSE),\"\")","v":"Gärtner David"},"ok","",1,1,"","A3","Gärtner David",null,null,{"$f":"SMALL($B$2:$B$41,1)","v":1},{"$f":"IFERROR(VLOOKUP(M10,$B$2:$C$41,2,FALSE),\"\")","v":"Behling Oliver"},null,null,"Setzliste ab 20 Teilnehmer",null,"    PW Namenseingabe = 147",null,null,null,null,null,null,null,null,16,"4x4",null,"K.O.",null,"X",{"$f":"IF(AI10<>\"\",COUNTA($AI$2:$AI10),\"\")","v":""},null,null,"Bergmann Hans","","ok","",{"$f":"Berechnung!CZ10","v":"A1"},0,"A1","D3"]
[10,10,{"$f":"IFERROR(VLOOKUP(A11,AH11:$AK$500,4,FALSE),\"\")","v":"Hartung Andreas"},"ok","",1,1,"","D1","Hartung Andreas",null,null,{"$f":"SMALL($B$2:$B$41,2)","v":2},{"$f":"IFERROR(VLOOKUP(M11,$B$2:$C$41,2,FALSE),\"\")","v":"Brachmanski Dave"},null,null,"Freigabe-Code Finals: 148",null,"    PW Punktevergabe  = 147",null,null,null,null,null,null,null,null,17,"1x5 3x4",4,{"$f":"IF(AND(S12=17,AG1=\"X\"),\"K.O.\",\"Gruppen\")","v":"Gruppen"},{"$f":"IF(AND(S12<21,AG1=\"X\"),8,12)","v":12},"X",{"$f":"IF(AI11<>\"\",COUNTA($AI$2:$AI11),\"\")","v":""},null,null,"Bocksberger Aaron","",null,"",{"$f":"Berechnung!CZ11","v":"C1"},0,"C1","E3"]
[11,11,{"$f":"IFERROR(VLOOKUP(A12,AH12:$AK$500,4,FALSE),\"\")","v":"Hofmann Frank"},"ok","",1,1,"","G3","Hofmann Frank",null,null,{"$f":"SMALL($B$2:$B$41,3)","v":3},"Brömel Frank",null,null,"Startgeld = 17,00 €",null,{"$f":"G43","v":24},"Spieler nehmen teil",null,null,null,null,null,null,null,18,"2x5 2x4",4,{"$f":"IF(AND(S12=18,AG1=\"X\"),\"K.O.\",\"Gruppen\")","v":"Gruppen"},{"$f":"IF(AND(S122<21,AG1=\"X\"),8,12)","v":8},"X",{"$f":"IF(AI12<>\"\",COUNTA($AI$2:$AI12),\"\")","v":""},null,null,"Bonitz Jörg","",null,"",{"$f":"Berechnung!CZ12","v":"C3"},0,"C3","B2"]
[12,12,{"$f":"IFERROR(VLOOKUP(A13,AH13:$AK$500,4,FALSE),\"\")","v":"Isermann Rene"},"ok","",1,1,"","C3","Isermann Rene",null,null,{"$f":"SMALL($B$2:$B$41,4)","v":4},"Delling Tino",null,null,"Version 02.01.2024",null,"Modus:",{"$f":"IFERROR(VLOOKUP(S12,$AB$2:$AC$46,2,FALSE),\"\")","v":"8x3"},null,null,null,null,null,null,"Gruppen",19,"3x5 1x4",null,{"$f":"IF(AND(S12=19,AG1=\"X\"),\"K.O.\",\"Gruppen\")","v":"Gruppen"},null,"X",{"$f":"IF(AI13<>\"\",COUNTA($AI$2:$AI13),\"\")","v":2},"ok",null,"Brachmanski Dave",1549.3112733020653,"ok","",{"$f":"Berechnung!CZ13","v":"E2"},0,"E2","A2"]
[13,13,{"$f":"IFERROR(VLOOKUP(A14,AH14:$AK$500,4,FALSE),\"\")","v":"Jeroch Paul"},"ok","",1,1,"","F1","Jeroch Paul",null,null,{"$f":"SMALL($B$2:$B$41,5)","v":5},"Drahn Robert",null,null,"© Copyright by T. Delling",null,"Shootoutzeit einstellen:",null,null,8,null,"2x4",2,{"$f":"VLOOKUP(S12,$V$14:$Y$46,4,FALSE)","v":8},"00:55:00",20,"4x5",null,{"$f":"IF(AND(S12=20,AG1=\"X\"),\"K.O.\",\"Gruppen\")","v":"Gruppen"},null,"X",{"$f":"IF(AI14<>\"\",COUNTA($AI$2:$AI14),\"\")","v":3},"ok",null,"Brömel Frank",2824.3959013907238,"ok","",{"$f":"Berechnung!CZ14","v":"B3"},0,"B3","H3"]
[14,14,{"$f":"IFERROR(VLOOKUP(A15,AH15:$AK$500,4,FALSE),\"\")","v":"Löffel Ulrich"},"ok","",1,1,"","G1","Löffel Ulrich",null,null,{"$f":"SMALL($B$2:$B$41,6)","v":6},"Elham Faiz",null,null,"Bei Fragen: 147max@freenet.de",null,"Reset - Code: 1309",null,null,9,null,"1x4 1x5",2,{"$f":"IF(AND(S12<21,AG1=\"X\"),4,IF(AND(AG1=\"X\",S12=24),6,0))","v":6},null,21,"3x4 3x3",6,"Gruppen",12,"X",{"$f":"IF(AI15<>\"\",COUNTA($AI$2:$AI15),\"\")","v":""},null,null,"Brünner Thomas","",null,"",{"$f":"Berechnung!CZ15","v":"B2"},0,"B2","H2"]
[15,15,{"$f":"IFERROR(VLOOKUP(A16,AH16:$AK$500,4,FALSE),\"\")","v":"Müller Marcus"},"ok","",1,1,"","F2","Müller Marcus",null,null,{"$f":"SMALL($B$2:$B$41,7)","v":7},"Fandrei Andreas",null,null,"Tel.: 0174 / 3076906",null,"setzt die Auslosung zurück",null,null,10,null,"2x5",2,null,null,{"$f":"V28","v":22},"4x4 2x3",null,"Gruppen",null,"X",{"$f":"IF(AI16<>\"\",COUNTA($AI$2:$AI16),\"\")","v":""},null,null,"Buße Christopher","",null,"",{"$f":"Berechnung!CZ16","v":"H1"},0,"H1","G3"]
[16,16,{"$f":"IFERROR(VLOOKUP(A17,AH17:$AK$500,4,FALSE),\"\")","v":"Rejke Ronny"},"ok","",1,1,"","F3","Rejke Ronny",null,null,{"$f":"SMALL($B$2:$B$41,8)","v":8},"Fandrei Joel",null,null,"Platzierung","12-15 TN","8-15 TN","16-23 TN",null,11,null,"1x3 2x4",{"$f":"IF(AG1=\"\",3,4)","v":4},null,"24-40 TN",23,"5x4 1x3",null,"Gruppen",null,"X",{"$f":"IF(AI17<>\"\",COUNTA($AI$2:$AI17),\"\")","v":""},null,null,"Chen Wie","",null,"",{"$f":"Berechnung!CZ17","v":"D2"},0,"D2","C3"]
[17,17,{"$f":"IFERROR(VLOOKUP(A18,AH18:$AK$500,4,FALSE),\"\")","v":"Stachly Marec"},"ok","",1,1,"","G2","Stachly Marec",null,null,{"$f":"SMALL($B$2:$B$41,9)","v":9},"Gärtner David",null,null,"1. Platz",150,150,250,null,12,null,"4x3",4,null,350,24,"8x3",{"$f":"VLOOKUP(AB18,$V$14:$Y$46,4,FALSE)","v":8},{"$f":"IF(AND(S12=24,AG1=\"\"),\"Gruppen\",\"K.O.\")","v":"K.O."},{"$f":"IF(AND(S122<21,AG1=\"X\"),16,12)","v":16},"X",{"$f":"IF(AI18<>\"\",COUNTA($AI$2:$AI18),\"\")","v":4},"ok",null,"Delling Tino",11793.783966122774,"ok","",{"$f":"Berechnung!CZ18","v":"C2"},0,"C2","F2"]
[18,18,{"$f":"IFERROR(VLOOKUP(A19,AH19:$AK$500,4,FALSE),\"\")","v":"Straßburger Marko"},"ok","",1,1,"","D3","Straßburger Marko",null,null,{"$f":"SMALL($B$2:$B$41,10)","v":10},"Hartung Andreas",null,null,"2. Platz",120,120,200,null,13,null,"3x3 1x4",4,null,300,25,"7x3 1x4",8,"K.O.",16,"X",{"$f":"IF(AI19<>\"\",COUNTA($AI$2:$AI19),\"\")","v":5},"ok",null,"Drahn Robert",11091.330823967684,null,"",{"$f":"Berechnung!CZ19","v":"F1"},0,"F1","F3"]
[19,19,{"$f":"IFERROR(VLOOKUP(A20,AH20:$AK$500,4,FALSE),\"\")","v":"Suttner Magnus"},"ok","",1,1,"","D2","Suttner Magnus",null,null,{"$f":"SMALL($B$2:$B$41,11)","v":11},"Hofmann Frank",null,null,"3. Platz",100,90,140,null,14,null,"2x3 2x4",4,null,230,26,"6x3 2x4",null,"K.O.",null,"X",{"$f":"IF(AI20<>\"\",COUNTA($AI$2:$AI20),\"\")","v":6},"ok",null,"Elham Faiz",19157.960888020276,"ok","",{"$f":"Berechnung!CZ20","v":"E1"},0,"E1","B3"]
[20,20,{"$f":"IFERROR(VLOOKUP(A21,AH21:$AK$500,4,FALSE),\"\")","v":"Swennen Andy"},"ok","",1,1,"","E1",{"$f":"IF(C21>\"\",C21,\"\")","v":"Swennen Andy"},null,null,{"$f":"SMALL($B$2:$B$41,12)","v":12},"Isermann Rene",null,null,"3. Platz",80,90,140,null,15,null,"1x3 3x4",4,null,230,27,"5x3 3x4",null,"K.O.",null,"X",{"$f":"IF(AI21<>\"\",COUNTA($AI$2:$AI21),\"\")","v":""},null,null,"Faarooq Rayumer","","ok","",{"$f":"Berechnung!CZ21","v":"G3"},0,"G3","E2"]
[21,21,{"$f":"IFERROR(VLOOKUP(A22,AH22:$AK$500,4,FALSE),\"\")","v":"Thomas Moritz"},"ok","",1,1,"","H3","Thomas Moritz",null,null,{"$f":"SMALL($B$2:$B$41,13)","v":13},"Jeroch Paul",null,null,"Viertelfinale",50,50,100,null,16,null,"4x4",4,null,150,28,"4x3 4x4",null,"K.O.",null,"X",{"$f":"IF(AI22<>\"\",COUNTA($AI$2:$AI22),\"\")","v":7},"ok",null,"Fandrei Andreas",227.12441632158908,"ok","",{"$f":"Berechnung!CZ22","v":"F3"},0,"F3","A3"]
[22,22,{"$f":"IFERROR(VLOOKUP(A23,AH23:$AK$500,4,FALSE),\"\")","v":"Valderrama Salvador"},"ok","",1,1,"","A1","Valderrama Salvador",null,null,{"$f":"SMALL($B$2:$B$41,14)","v":14},"Löffel Ulrich",null,null,"2. Runde (Gr. o. AF)",null,"-",60,null,17,null,{"$f":"IF(AG1=\"X\",\"1x5 3x4\",\"2x43x3\")","v":"1x5 3x4"},{"$f":"IF(AG1=\"\",5,4)","v":4},null,100,29,"3x3 5x4",null,"K.O.",null,"X",{"$f":"IF(AI23<>\"\",COUNTA($AI$2:$AI23),\"\")","v":8},"ok",null,"Fandrei Joel",6853.02835411864,"ok","",{"$f":"Berechnung!CZ23","v":"H3"},0,"H3","C2"]
[23,23,{"$f":"IFERROR(VLOOKUP(A24,AH24:$AK$500,4,FALSE),\"\")","v":"Weber Marco"},"ok","",1,1,"","B3","Weber Marco",null,null,{"$f":"SMALL($B$2:$B$41,15)","v":15},"Müller Marcus",null,null,"Teilnahme",null,20,30,null,18,null,{"$f":"IF(AG1=\"X\",\"2x5 2x4\",\"6x3\")","v":"2x5 2x4"},{"$f":"IF($AG$1=\"\",6,4)","v":4},null,50,30,"2x3 6x4",null,"K.O.",null,"X",{"$f":"IF(AI24<>\"\",COUNTA($AI$2:$AI24),\"\")","v":""},null,null,"Fertellioglu Bugrahan","",null,"",{"$f":"Berechnung!CZ24","v":"B1"},0,"B1","G2"]
[24,24,{"$f":"IFERROR(VLOOKUP(A25,AH25:$AK$500,4,FALSE),\"\")","v":"Witzik Oliver"},"ok","",1,1,"","C2","Witzik Oliver",null,null,{"$f":"SMALL($B$2:$B$41,16)","v":16},"Rejke Ronny",null,null,null,"entfällt",null,null,null,19,null,{"$f":"IF(AG1=\"X\",\"3x5 1x4\",\"1X4 5x3\")","v":"3x5 1x4"},{"$f":"IF($AG$1=\"\",6,4)","v":4},null,null,31,"1x3 7x4",null,"K.O.",null,"X",{"$f":"IF(AI25<>\"\",COUNTA($AI$2:$AI25),\"\")","v":""},null,null,"Födisch Sebastian","",null,"",{"$f":"Berechnung!CZ25","v":"G1"},0,"G1","D2"]
[25,25,{"$f":"IFERROR(VLOOKUP(A26,AH26:$AK$500,4,FALSE),\"\")","v":""},null,"",0,0,"","","",null,null,{"$f":"SMALL($B$2:$B$41,17)","v":17},"Stachly Marec",null,null,"Start- / Preisgeldberechnung",null,null,"Gesamt",null,20,null,{"$f":"IF(AG1=\"X\",\"4x5\",\"2x4 4x3\")","v":"4x5"},4,null,null,32,"8x4",null,"K.O.",null,"",{"$f":"IF(AI26<>\"\",COUNTA($AI$2:$AI26),\"\")","v":""},null,null,"Fritz Thomas","",null,"",{"$f":"Berechnung!CZ26","v":""},0,"",""]
[26,26,{"$f":"IFERROR(VLOOKUP(A27,AH27:$AK$500,4,FALSE),\"\")","v":""},null,"",0,0,"","","",null,null,{"$f":"SMALL($B$2:$B$41,18)","v":18},"Straßburger Marko",null,null,"Startgeld 1 Tag:",null,17,{"$f":"S27*S28","v":408},null,21,null,"3x4 3x3",6,null,null,33,"7x4 1x5",null,"K.O.",null,"",{"$f":"IF(AI27<>\"\",COUNTA($AI$2:$AI27),\"\")","v":""},null,null,"Fröhlich Christian","",null,"",{"$f":"Berechnung!CZ27","v":""},0,"",""]
[27,27,{"$f":"IFERROR(VLOOKUP(A28,AH28:$AK$500,4,FALSE),\"\")","v":""},null,"",0,0,"","","",null,null,{"$f":"SMALL($B$2:$B$41,19)","v":19},"Suttner Magnus",null,null,"Teilnehmer / GST Jackpot:",null,{"$f":"D42","v":24},{"$f":"S28*2","v":48},null,22,null,"4x4 2x3",6,null,null,34,"6x4 2x5",null,"K.O.",null,"",{"$f":"IF(AI28<>\"\",COUNTA($AI$2:$AI28),\"\")","v":""},null,null,"Gabriel Christian","",null,"",{"$f":"Berechnung!CZ28","v":""},0,"",""]
[28,28,{"$f":"IFERROR(VLOOKUP(A29,AH29:$AK$500,4,FALSE),\"\")","v":""},null,"",0,0,"","","",null,null,{"$f":"SMALL($B$2:$B$41,20)","v":20},"Swennen Andy",null,null,"TN Gesamt / Preisgeld:",null,{"$f":"S28","v":24},{"$f":"S27*S28-T28","v":360},null,23,null,"5x4 1x3",6,null,null,35,"5x4 3x5",null,"K.O.",null,"",{"$f":"IF(AI29<>\"\",COUNTA($AI$2:$AI29),\"\")","v":""},null,null,"Gaede Charly","",null,"",{"$f":"Berechnung!CZ29","v":""},0,"",""]
[29,29,{"$f":"IFERROR(VLOOKUP(A30,AH30:$AK$500,4,FALSE),\"\")","v":""},null,"",0,0,"","","",null,null,{"$f":"SMALL($B$2:$B$41,21)","v":21},"Thomas Moritz",null,null,"Jackpot 3LR:",null,2.5,{"$f":"S29*S30","v":60},null,24,null,{"$f":"IF(AG1=\"\",\"6x4\",IF(AG1=\"X\",\"8x3\"))","v":"8x3"},{"$f":"IF(AG1=\"\",6,8)","v":8},null,null,36,"4x4 4x5",null,"K.O.",null,"",{"$f":"IF(AI30<>\"\",COUNTA($AI$2:$AI30),\"\")","v":9},"ok",null,"Gärtner David",15802.10092505672,null,"",{"$f":"Berechnung!CZ30","v":""},0,"",""]
[30,30,{"$f":"IFERROR(VLOOKUP(A31,AH31:$AK$500,4,FALSE),\"\")","v":""},null,"",0,0,"","","",null,null,{"$f":"SMALL($B$2:$B$41,22)","v":22},"Valderrama Salvador",null,null,"Jackpot 100+:",null,0.5,{"$f":"S29*S31","v":12},null,25,null,"7x3 1x4",8,null,null,37,"3x4 5x5",null,"K.O.",null,"",{"$f":"IF(AI31<>\"\",COUNTA($AI$2:$AI31),\"\")","v":""},null,null,"Gehrke Mario","",null,"",{"$f":"Berechnung!CZ31","v":""},0,"",""]
[31,31,{"$f":"IFERROR(VLOOKUP(A32,AH32:$AK$500,4,FALSE),\"\")","v":""},null,"",0,0,"","","",null,null,{"$f":"SMALL($B$2:$B$41,23)","v":23},"Weber Marco",null,null,"Ausschüttung / Jackpot:",null,null,{"$f":"T29-T30-T31","v":288},null,26,null,"6x3 2x4",8,null,null,38,"2x4 6x5",null,"K.O.",null,"",{"$f":"IF(AI32<>\"\",COUNTA($AI$2:$AI32),\"\")","v":""},null,null,"Gheran Florin","",null,"",{"$f":"Berechnung!CZ32","v":""},0,"",""]
[32,32,{"$f":"IFERROR(VLOOKUP(A33,AH33:$AK$500,4,FALSE),\"\")","v":""},null,"",0,0,"","","",null,null,{"$f":"SMALL($B$2:$B$41,24)","v":24},"Witzik Oliver",null,null,"1. Platz",null,"1x",{"$f":"IF($S$29<20,$T$32*40%,IF($S$29>19,$T$32*35%))","v":100.8},null,27,null,"5x3 3x4",8,null,{"$f":"T33","v":100.8},39,"1x4 7x5",null,"K.O.",null,"",{"$f":"IF(AI33<>\"\",COUNTA($AI$2:$AI33),\"\")","v":""},null,null,"Grüner Ann-Cathrin","","ok","",{"$f":"Berechnung!CZ33","v":""},0,"",""]
[33,33,{"$f":"IFERROR(VLOOKUP(A34,AH34:$AK$500,4,FALSE),\"\")","v":""},null,"",0,0,"","","",null,null,{"$f":"SMALL($B$2:$B$41,25)","v":25},"",null,null,"2. Platz",null,"1x",{"$f":"IF($S$29<20,$T$32*30%,IF($S$29>19,$T$32*25%))","v":72},null,28,null,"4x3 4x4",8,null,{"$f":"T34","v":72},40,"8x5",null,"K.O.",null,"",{"$f":"IF(AI34<>\"\",COUNTA($AI$2:$AI34),\"\")","v":""},null,null,"Habrom Hilmar","",null,"",{"$f":"Berechnung!CZ34","v":""},0,"",""]
[34,34,{"$f":"IFERROR(VLOOKUP(A35,AH35:$AK$500,4,FALSE),\"\")","v":""},null,"",0,0,{"$f":"IF(E35=\"x\",C35,\"\")","v":""},"","",null,null,{"$f":"SMALL($B$2:$B$41,26)","v":26},"",null,null,"2 x 3. Platz",null,"2x",{"$f":"IF($S$29<20,$T$32*15%,IF($S$29>19,$T$32*10%))","v":28.8},null,29,null,"3x3 5x4",8,null,{"$f":"T35*2","v":57.6},null,null,null,null,null,"",{"$f":"IF(AI35<>\"\",COUNTA($AI$2:$AI35),\"\")","v":""},null,null,"Haidary Enayat","",null,"",{"$f":"Berechnung!CZ35","v":""},0,"",""]
[35,35,{"$f":"IFERROR(VLOOKUP(A36,AH36:$AK$500,4,FALSE),\"\")","v":""},null,"",0,0,"","","",null,null,{"$f":"SMALL($B$2:$B$41,27)","v":27},"",null,null,"ab 20 Teilnehmer: 4 x 5. Platz",null,"4x",{"$f":"IF($S$29<20,$T$32*0%,IF($S$29>19,$T$32*5%))","v":14.4},null,30,null,"2x3 6x4",8,null,{"$f":"T36*4","v":57.6},null,"    Änderung den Gruppen bei 17-24 TN",null,null,null,"",{"$f":"IF(AI36<>\"\",COUNTA($AI$2:$AI36),\"\")","v":""},null,null,"Hänel Holger","",null,"",{"$f":"Berechnung!CZ36","v":""},0,"",""]
[36,36,{"$f":"IFERROR(VLOOKUP(A37,AH37:$AK$500,4,FALSE),\"\")","v":""},null,"",0,0,"","","",null,null,{"$f":"SMALL($B$2:$B$41,28)","v":28},"",null,null,"bezahltes Startgeld:",null,{"$f":"D42","v":24},{"$f":"S27*S37","v":408},null,31,null,"1x3 7x4",8,null,{"$f":"SUM(AA33:AA36)","v":288},true,null,null,null,null,"",{"$f":"IF(AI37<>\"\",COUNTA($AI$2:$AI37),\"\")","v":10},"ok",null,"Hartung Andreas",1267.1904234267006,null,"",{"$f":"Berechnung!CZ37","v":""},0,"",""]
[37,37,{"$f":"IFERROR(VLOOKUP(A38,AH38:$AK$500,4,FALSE),\"\")","v":""},null,"",0,0,"","","",null,null,{"$f":"SMALL($B$2:$B$41,29)","v":29},"",null,null,"GST Gebühr 10€ pro Saison:",null,4,{"$f":"S38*10","v":40},null,32,null,"8x4",8,null,null,null,null,null,null,null,"",{"$f":"IF(AI38<>\"\",COUNTA($AI$2:$AI38),\"\")","v":""},null,null,"Hermsdorf Hannes","",null,"",{"$f":"Berechnung!CZ38","v":""},0,"",""]
[38,38,{"$f":"IFERROR(VLOOKUP(A39,AH39:$AK$500,4,FALSE),\"\")","v":""},null,"",0,0,"","","",null,null,{"$f":"SMALL($B$2:$B$41,30)","v":30},"",null,null,"Behling",null,null,null,null,33,null,"7x4 1x5",8,null,null,null,null,null,null,null,"",{"$f":"IF(AI39<>\"\",COUNTA($AI$2:$AI39),\"\")","v":""},null,null,"Hirth Christian","","ok","",{"$f":"Berechnung!CZ39","v":""},0,"",""]
[39,39,{"$f":"IFERROR(VLOOKUP(A40,AH40:$AK$500,4,FALSE),\"\")","v":""},null,"",0,0,"","","",null,null,{"$f":"SMALL($B$2:$B$41,31)","v":31},"",null,null,"Hofmann",null,null,{"$f":"T29-T30-T31","v":288},null,34,null,"6x4 2x5",8,null,null,null,null,null,null,null,"",{"$f":"IF(AI40<>\"\",COUNTA($AI$2:$AI40),\"\")","v":11},"ok",null,"Hofmann Frank",319.61905263183877,null,"",{"$f":"Berechnung!CZ40","v":""},0,"",""]
[40,40,{"$f":"IFERROR(VLOOKUP(A41,AH41:$AK$500,4,FALSE),\"\")","v":""},null,"",0,0,"","","",null,null,{"$f":"SMALL($B$2:$B$41,32)","v":32},"",null,null,"Witzik",null,null,{"$f":"T29-T30-T31","v":288},null,35,null,"5x4 3x5",8,null,null,null,null,null,null,null,{"$f":"IF(D41=\"\",\"\",IF(OR(D41=1,D41=\"OK\"),\"X\",IF(D41=2,\"y\")))","v":""},{"$f":"IF(AI41<>\"\",COUNTA($AI$2:$AI41),\"\")","v":""},null,null,"Hollensen Olaf","","ok","",{"$f":"Berechnung!CZ41","v":""},0,"",""]
[null,null,null,{"$f":"COUNTA(D2:D41)","v":24},null,0,0,null,null,null,null,null,{"$f":"SMALL($B$2:$B$41,33)","v":33},"",null,null,"Drahn",null,null,null,null,36,null,"4x4 4x5",8,null,null,null,null,null,null,null,{"$f":"COUNTIF(AG2:AG41,\"X\")","v":24},{"$f":"IF(AI42<>\"\",COUNTA($AI$2:$AI42),\"\")","v":""},null,null,"Hollin Andreas","",null,"",null,0]
[null,null,null,null,null,{"$f":"SUM(F2:F41)","v":24},{"$f":"SUM(G2:G41)","v":24},null,null,null,null,null,{"$f":"SMALL($B$2:$B$41,34)","v":34},"",null,null,null,null,null,null,null,37,null,"3x4 5x5",8,null,null,null,null,null,null,null,{"$f":"COUNTIF(AG2:AG41,\"Y\")","v":0},{"$f":"IF(AI43<>\"\",COUNTA($AI$2:$AI43),\"\")","v":""},null,null,"Hollnagel Gustav","",null,"",null,0]
[null,null,null,null,null,null,null,null,null,null,null,null,{"$f":"SMALL($B$2:$B$41,35)","v":35},"",null,null,null,null,null,null,null,38,null,"2x4 6x5",8,null,null,null,null,null,null,null,null,{"$f":"IF(AI44<>\"\",COUNTA($AI$2:$AI44),\"\")","v":""},null,null,"Ilmer Daniel","",null,"",null,0]
[null,null,null,null,null,null,null,null,null,null,null,null,{"$f":"SMALL($B$2:$B$41,36)","v":36},"",null,null,null,null,null,null,null,39,null,"1x4 7x5",8,null,null,null,null,null,null,null,null,{"$f":"IF(AI45<>\"\",COUNTA($AI$2:$AI45),\"\")","v":12},"ok",null,"Isermann Rene",18206.264467741672,null,"",null,0]
[null,null,null,null,null,null,null,null,null,null,null,null,{"$f":"SMALL($B$2:$B$41,37)","v":37},{"$f":"IFERROR(VLOOKUP(M46,$B$2:$C$41,2,FALSE),\"\")","v":""},null,null,null,null,null,null,null,40,null,"8x5",8,null,null,null,null,null,null,null,null,{"$f":"IF(AI46<>\"\",COUNTA($AI$2:$AI46),\"\")","v":""},null,null,"Jacob Frank","",null,"",null,0]
[null,null,null,null,null,null,null,null,null,null,null,null,{"$f":"SMALL($B$2:$B$41,38)","v":38},{"$f":"IFERROR(VLOOKUP(M47,$B$2:$C$41,2,FALSE),\"\")","v":""},null,null,null,null,null,null,null,null,null,null,null,null,null,null,null,null,null,null,null,{"$f":"IF(AI47<>\"\",COUNTA($AI$2:$AI47),\"\")","v":""},null,null,"Jahn Rainer","",null,"",null,0]
[null,null,null,null,null,null,null,null,null,null,null,null,{"$f":"SMALL($B$2:$B$41,39)","v":39},"",null,null,null,null,null,null,null,null,null,null,null,null,null,null,null,null,null,null,null,{"$f":"IF(AI48<>\"\",COUNTA($AI$2:$AI48),\"\")","v":""},null,null,"Jaritz Christopher","","ok","",null,0]
[null,null,null,null,null,null,null,null,null,null,null,null,{"$f":"SMALL($B$2:$B$41,40)","v":40},"",null,null,null,null,null,null,null,null,null,null,null,null,null,null,null,null,null,null,null,{"$f":"IF(AI49<>\"\",COUNTA($AI$2:$AI49),\"\")","v":""},null,null,"Jasemi Saman","",null,"",null,0]
[null,null,null,null,null,null,null,null,null,null,null,null,null,null,null,null,null,null,null,null,null,null,null,null,null,null,null,null,null,null,null,null,null,{"$f":"IF(AI50<>\"\",COUNTA($AI$2:$AI50),\"\")","v":13},"ok",null,"Jeroch Paul",13365.217310498603,"ok","",null,0]
[null,null,null,null,null,null,null,null,null,null,null,null,null,null,null,null,null,null,null,null,null,null,null,null,null,null,null,null,null,null,null,null,null,{"$f":"IF(AI51<>\"\",COUNTA($AI$2:$AI51),\"\")","v":""},null,null,"Jungk Christian","",null,"",null,0]
[null,null,null,null,null,null,null,null,null,null,null,null,null,null,null,null,null,null,null,null,null,null,null,null,null,null,null,null,null,null,null,null,null,{"$f":"IF(AI52<>\"\",COUNTA($AI$2:$AI52),\"\")","v":""},null,null,"Kah Thomas","",null,"",null,0]
[null,null,null,null,null,null,null,null,null,null,null,null,null,null,null,null,null,null,null,null,null,null,null,null,null,null,null,null,null,null,null,null,null,{"$f":"IF(AI53<>\"\",COUNTA($AI$2:$AI53),\"\")","v":""},null,null,"Kallies Stephan","",null,"",null,0]
[null,null,null,null,null,null,null,null,null,null,null,null,null,null,null,null,null,null,null,null,null,null,null,null,null,null,null,null,null,null,null,null,null,{"$f":"IF(AI54<>\"\",COUNTA($AI$2:$AI54),\"\")","v":""},null,null,"Kämpfer Norbert","",null,"",null,0]
[null,null,null,null,null,null,null,null,null,null,null,null,null,null,null,null,null,null,null,null,null,null,null,null,null,null,null,null,null,null,null,null,null,{"$f":"IF(AI55<>\"\",COUNTA($AI$2:$AI55),\"\")","v":""},null,null,"Kandler Michael","","ok","",null,0]
[null,null,null,null,null,null,null,null,null,null,null,null,null,null,null,null,null,null,null,null,null,null,null,null,null,null,null,null,null,null,null,null,null,{"$f":"IF(AI56<>\"\",COUNTA($AI$2:$AI56),\"\")","v":""},null,null,"Karries Stev","",null,"",null,0]
[null,null,null,null,null,null,null,null,null,null,null,null,null,null,null,null,null,null,null,null,null,null,null,null,null,null,null,null,null,null,null,null,null,{"$f":"IF(AI57<>\"\",COUNTA($AI$2:$AI57),\"\")","v":""},null,null,"Kaufmann Luca","",null,"",null,0]
[null,null,null,null,null,null,null,null,null,null,null,null,null,null,null,null,null,null,null,null,null,null,null,null,null,null,null,null,null,null,null,null,null,{"$f":"IF(AI58<>\"\",COUNTA($AI$2:$AI58),\"\")","v":""},null,null,"Kensy Tobias","","ok","",null,0]
[null,null,null,null,null,null,null,null,null,null,null,null,null,null,null,null,null,null,null,null,null,null,null,null,null,null,null,null,null,null,null,null,null,{"$f":"IF(AI59<>\"\",COUNTA($AI$2:$AI59),\"\")","v":""},null,null,"Kesselring Andreas","",null,"",null,0]
[null,null,null,null,null,null,null,null,null,null,null,null,null,null,null,null,null,null,null,null,null,null,null,null,null,null,null,null,null,null,null,null,null,{"$f":"IF(AI60<>\"\",COUNTA($AI$2:$AI60),\"\")","v":""},null,null,"Khalid Umair","","ok","",null,0]
[null,null,null,null,null,null,null,null,null,null,null,null,null,null,null,null,null,null,null,null,null,null,null,null,null,null,null,null,null,null,null,null,null,{"$f":"IF(AI61<>\"\",COUNTA($AI$2:$AI61),\"\")","v":""},null,null,"Kies Christoph","",null,"",null,0]
[null,null,null,null,null,null,null,null,null,null,null,null,null,null,null,null,null,null,null,null,null,null,null,null,null,null,null,null,null,null,null,null,null,{"$f":"IF(AI62<>\"\",COUNTA($AI$2:$AI62),\"\")","v":""},null,null,"Kirim Ali","","ok","",null,0]
[null,null,null,null,null,null,null,null,null,null,null,null,null,null,null,null,null,null,null,null,null,null,null,null,null,null,null,null,null,null,null,null,null,{"$f":"IF(AI63<>\"\",COUNTA($AI$2:$AI63),\"\")","v":""},null,null,"Kirsten Felix","","ok","",null,0]
[null,null,null,null,null,null,null,null,null,null,null,null,null,null,null,null,null,null,null,null,null,null,null,null,null,null,null,null,null,null,null,null,null,{"$f":"IF(AI64<>\"\",COUNTA($AI$2:$AI64),\"\")","v":""},null,null,"Kloppisch Peter","",null,"",null,0]
[null,null,null,null,null,null,null,null,null,null,null,null,null,null,null,null,null,null,null,null,null,null,null,null,null,null,null,null,null,null,null,null,null,{"$f":"IF(AI65<>\"\",COUNTA($AI$2:$AI65),\"\")","v":""},null,null,"Kosniowski Matthias","",null,"",null,0]
[null,null,null,null,null,null,null,null,null,null,null,null,null,null,null,null,null,null,null,null,null,null,null,null,null,null,null,null,null,null,null,null,null,{"$f":"IF(AI66<>\"\",COUNTA($AI$2:$AI66),\"\")","v":""},null,null,"Kraege Thomas",{"$f":"IFERROR(IF(AI66=\"\",\"\",IF(AJ66=\"gesetzt\",RAND()*5000000,RAND()*1000*20)),\"\")","v":""},null,"",null,0]
[null,null,null,null,null,null,null,null,null,null,null,null,null,null,null,null,null,null,null,null,null,null,null,null,null,null,null,null,null,null,null,null,null,{"$f":"IF(AI67<>\"\",COUNTA($AI$2:$AI67),\"\")","v":""},null,null,"Kraus Hermann","","ok",{"$f":"IF(AJ67=\"\",\"\",AJ67)","v":""},null,{"$f":"IF(AN67=\"gesetzt\",1,0)","v":0}]
[null,null,null,null,null,null,null,null,null,null,null,null,null,null,null,null,null,null,null,null,null,null,null,null,null,null,null,null,null,null,null,null,null,{"$f":"IF(AI68<>\"\",COUNTA($AI$2:$AI68),\"\")","v":14},"ok",null,"Löffel Ulrich",14142.320366656242,"ok","",null,0]
[null,null,null,null,null,null,null,null,null,null,null,null,null,null,null,null,null,null,null,null,null,null,null,null,null,null,null,null,null,null,null,null,null,{"$f":"IF(AI69<>\"\",COUNTA($AI$2:$AI69),\"\")","v":""},null,null,"Lux Sebastian","",null,"",null,0]
[null,null,null,null,null,null,null,null,null,null,null,null,null,null,null,null,null,null,null,null,null,null,null,null,null,null,null,null,null,null,null,null,null,{"$f":"IF(AI70<>\"\",COUNTA($AI$2:$AI70),\"\")","v":""},null,null,"Marmucki Lukas","",null,"",null,0]
[null,null,null,null,null,null,null,null,null,null,null,null,null,null,null,null,null,null,null,null,null,null,null,null,null,null,null,null,null,null,null,null,null,{"$f":"IF(AI71<>\"\",COUNTA($AI$2:$AI71),\"\")","v":""},null,null,"Martynov Sergej","",null,"",null,0]
[null,null,null,null,null,null,null,null,null,null,null,null,null,null,null,null,null,null,null,null,null,null,null,null,null,null,null,null,null,null,null,null,null,{"$f":"IF(AI72<>\"\",COUNTA($AI$2:$AI72),\"\")","v":""},null,null,"Metzler Thomas","",null,"",null,0]
[null,null,null,null,null,null,null,null,null,null,null,null,null,null,null,null,null,null,null,null,null,null,null,null,null,null,null,null,null,null,null,null,null,{"$f":"IF(AI73<>\"\",COUNTA($AI$2:$AI73),\"\")","v":""},null,null,"Muhammad Umer","","ok","",null,0]
[null,null,null,null,null,null,null,null,null,null,null,null,null,null,null,null,null,null,null,null,null,null,null,null,null,null,null,null,null,null,null,null,null,{"$f":"IF(AI74<>\"\",COUNTA($AI$2:$AI74),\"\")","v":""},null,null,"Müller Frank","",null,"",null,0]
[null,null,null,null,null,null,null,null,null,null,null,null,null,null,null,null,null,null,null,null,null,null,null,null,null,null,null,null,null,null,null,null,null,{"$f":"IF(AI75<>\"\",COUNTA($AI$2:$AI75),\"\")","v":15},"ok",null,"Müller Marcus",3105.1165813449666,"ok","",null,0]
[null,null,null,null,null,null,null,null,null,null,null,null,null,null,null,null,null,null,null,null,null,null,null,null,null,null,null,null,null,null,null,null,null,{"$f":"IF(AI76<>\"\",COUNTA($AI$2:$AI76),\"\")","v":""},null,null,"Müller Tom","",null,"",null,0]
[null,null,null,null,null,null,null,null,null,null,null,null,null,null,null,null,null,null,null,null,null,null,null,null,null,null,null,null,null,null,null,null,null,{"$f":"IF(AI77<>\"\",COUNTA($AI$2:$AI77),\"\")","v":""},null,null,"N. Schmidt Paul","",null,"",null,0]
[null,null,null,null,null,null,null,null,null,null,null,null,null,null,null,null,null,null,null,null,null,null,null,null,null,null,null,null,null,null,null,null,null,{"$f":"IF(AI78<>\"\",COUNTA($AI$2:$AI78),\"\")","v":""},null,null,"Neumann Tobias","",null,"",null,0]
[null,null,null,null,null,null,null,null,null,null,null,null,null,null,null,null,null,null,null,null,null,null,null,null,null,null,null,null,null,null,null,null,null,{"$f":"IF(AI79<>\"\",COUNTA($AI$2:$AI79),\"\")","v":""},null,null,"Ohlenroth Sven","",null,"",null,0]
[null,null,null,null,null,null,null,null,null,null,null,null,null,null,null,null,null,null,null,null,null,null,null,null,null,null,null,null,null,null,null,null,null,{"$f":"IF(AI80<>\"\",COUNTA($AI$2:$AI80),\"\")","v":""},null,null,"Ossowski Andre","",null,"",null,0]
[null,null,null,null,null,null,null,null,null,null,null,null,null,null,null,null,null,null,null,null,null,null,null,null,null,null,null,null,null,null,null,null,null,{"$f":"IF(AI81<>\"\",COUNTA($AI$2:$AI81),\"\")","v":""},null,null,"Ouhsain Oussama","","ok","",null,0]
[null,null,null,null,null,null,null,null,null,null,null,null,null,null,null,null,null,null,null,null,null,null,null,null,null,null,null,null,null,null,null,null,null,{"$f":"IF(AI82<>\"\",COUNTA($AI$2:$AI82),\"\")","v":""},null,null,"Pfeiffer Jakob","",null,"",null,0]
[null,null,null,null,null,null,null,null,null,null,null,null,null,null,null,null,null,null,null,null,null,null,null,null,null,null,null,null,null,null,null,null,null,{"$f":"IF(AI83<>\"\",COUNTA($AI$2:$AI83),\"\")","v":""},null,null,"Rapior Frank","",null,"",null,0]
[null,null,null,null,null,null,null,null,null,null,null,null,null,null,null,null,null,null,null,null,null,null,null,null,null,null,null,null,null,null,null,null,null,{"$f":"IF(AI84<>\"\",COUNTA($AI$2:$AI84),\"\")","v":""},null,null,"Rath Thomas","",null,"",null,0]
[null,null,null,null,null,null,null,null,null,null,null,null,null,null,null,null,null,null,null,null,null,null,null,null,null,null,null,null,null,null,null,null,null,{"$f":"IF(AI85<>\"\",COUNTA($AI$2:$AI85),\"\")","v":""},null,null,"Reinel Jürgen","",null,"",null,0]
[null,null,null,null,null,null,null,null,null,null,null,null,null,null,null,null,null,null,null,null,null,null,null,null,null,null,null,null,null,null,null,null,null,{"$f":"IF(AI86<>\"\",COUNTA($AI$2:$AI86),\"\")","v":""},null,null,"Reinel Sebastian","",null,"",null,0]
[null,null,null,null,null,null,null,null,null,null,null,null,null,null,null,null,null,null,null,null,null,null,null,null,null,null,null,null,null,null,null,null,null,{"$f":"IF(AI87<>\"\",COUNTA($AI$2:$AI87),\"\")","v":""},null,null,"Reinhard Rene","",null,"",null,0]
[null,null,null,null,null,null,null,null,null,null,null,null,null,null,null,null,null,null,null,null,null,null,null,null,null,null,null,null,null,null,null,null,null,{"$f":"IF(AI88<>\"\",COUNTA($AI$2:$AI88),\"\")","v":16},"ok",null,"Rejke Ronny",7409.8825824680916,"ok","",null,0]
[null,null,null,null,null,null,null,null,null,null,null,null,null,null,null,null,null,null,null,null,null,null,null,null,null,null,null,null,null,null,null,null,null,{"$f":"IF(AI89<>\"\",COUNTA($AI$2:$AI89),\"\")","v":""},null,null,"Rentsch Marco","",null,"",null,0]
[null,null,null,null,null,null,null,null,null,null,null,null,null,null,null,null,null,null,null,null,null,null,null,null,null,null,null,null,null,null,null,null,null,{"$f":"IF(AI90<>\"\",COUNTA($AI$2:$AI90),\"\")","v":""},null,null,"Rosenberger Carl","",null,"",null,0]
[null,null,null,null,null,null,null,null,null,null,null,null,null,null,null,null,null,null,null,null,null,null,null,null,null,null,null,null,null,null,null,null,null,{"$f":"IF(AI91<>\"\",COUNTA($AI$2:$AI91),\"\")","v":""},null,null,"Rothaug Dennis","",null,"",null,0]
[null,null,null,null,null,null,null,null,null,null,null,null,null,null,null,null,null,null,null,null,null,null,null,null,null,null,null,null,null,null,null,null,null,{"$f":"IF(AI92<>\"\",COUNTA($AI$2:$AI92),\"\")","v":""},null,null,"Rzepka Stephan","",null,"",null,0]
[null,null,null,null,null,null,null,null,null,null,null,null,null,null,null,null,null,null,null,null,null,null,null,null,null,null,null,null,null,null,null,null,null,{"$f":"IF(AI93<>\"\",COUNTA($AI$2:$AI93),\"\")","v":""},null,null,"Sahre Manfred","",null,"",null,0]
[null,null,null,null,null,null,null,null,null,null,null,null,null,null,null,null,null,null,null,null,null,null,null,null,null,null,null,null,null,null,null,null,null,{"$f":"IF(AI94<>\"\",COUNTA($AI$2:$AI94),\"\")","v":""},null,null,"Salomon Thomas","",null,"",null,0]
[null,null,null,null,null,null,null,null,null,null,null,null,null,null,null,null,null,null,null,null,null,null,null,null,null,null,null,null,null,null,null,null,null,{"$f":"IF(AI95<>\"\",COUNTA($AI$2:$AI95),\"\")","v":""},null,null,"Scharl Jürgen","","ok","",null,0]
[null,null,null,null,null,null,null,null,null,null,null,null,null,null,null,null,null,null,null,null,null,null,null,null,null,null,null,null,null,null,null,null,null,{"$f":"IF(AI96<>\"\",COUNTA($AI$2:$AI96),\"\")","v":""},null,null,"Scheurer Rene","",null,"",null,0]
[null,null,null,null,null,null,null,null,null,null,null,null,null,null,null,null,null,null,null,null,null,null,null,null,null,null,null,null,null,null,null,null,null,{"$f":"IF(AI97<>\"\",COUNTA($AI$2:$AI97),\"\")","v":""},null,null,"Schildbach Tobias","",null,"",null,0]
[null,null,null,null,null,null,null,null,null,null,null,null,null,null,null,null,null,null,null,null,null,null,null,null,null,null,null,null,null,null,null,null,null,{"$f":"IF(AI98<>\"\",COUNTA($AI$2:$AI98),\"\")","v":""},null,null,"Schmid Christian","","ok","",null,0]
[null,null,null,null,null,null,null,null,null,null,null,null,null,null,null,null,null,null,null,null,null,null,null,null,null,null,null,null,null,null,null,null,null,{"$f":"IF(AI99<>\"\",COUNTA($AI$2:$AI99),\"\")","v":""},null,null,"Schmidt Dieter","","ok","",null,0]
[null,null,null,null,null,null,null,null,null,null,null,null,null,null,null,null,null,null,null,null,null,null,null,null,null,null,null,null,null,null,null,null,null,{"$f":"IF(AI100<>\"\",COUNTA($AI$2:$AI100),\"\")","v":""},null,null,"Schmidt Kevin","",null,"",null,0]
[null,null,null,null,null,null,null,null,null,null,null,null,null,null,null,null,null,null,null,null,null,null,null,null,null,null,null,null,null,null,null,null,null,{"$f":"IF(AI101<>\"\",COUNTA($AI$2:$AI101),\"\")","v":""},null,null,"Schneider Daniel","",null,"",null,0]
[null,null,null,null,null,null,null,null,null,null,null,null,null,null,null,null,null,null,null,null,null,null,null,null,null,null,null,null,null,null,null,null,null,{"$f":"IF(AI102<>\"\",COUNTA($AI$2:$AI102),\"\")","v":""},null,null,"Schranz Johannes","","ok","",null,0]
[null,null,null,null,null,null,null,null,null,null,null,null,null,null,null,null,null,null,null,null,null,null,null,null,null,null,null,null,null,null,null,null,null,{"$f":"IF(AI103<>\"\",COUNTA($AI$2:$AI103),\"\")","v":""},null,null,"Schumann Björn","",null,"",null,0]
[null,null,null,null,null,null,null,null,null,null,null,null,null,null,null,null,null,null,null,null,null,null,null,null,null,null,null,null,null,null,null,null,null,{"$f":"IF(AI104<>\"\",COUNTA($AI$2:$AI104),\"\")","v":""},null,null,"Schwarze Bernhard","",null,"",null,0]
[null,null,null,null,null,null,null,null,null,null,null,null,null,null,null,null,null,null,null,null,null,null,null,null,null,null,null,null,null,null,null,null,null,{"$f":"IF(AI105<>\"\",COUNTA($AI$2:$AI105),\"\")","v":""},null,null,"Seidel Michael","","ok","",null,0]
[null,null,null,null,null,null,null,null,null,null,null,null,null,null,null,null,null,null,null,null,null,null,null,null,null,null,null,null,null,null,null,null,null,{"$f":"IF(AI106<>\"\",COUNTA($AI$2:$AI106),\"\")","v":""},null,null,"Simon Fabio","","ok","",null,0]
[null,null,null,null,null,null,null,null,null,null,null,null,null,null,null,null,null,null,null,null,null,null,null,null,null,null,null,null,null,null,null,null,null,{"$f":"IF(AI107<>\"\",COUNTA($AI$2:$AI107),\"\")","v":""},null,null,"Sinden Leonard","",null,"",null,0]
[null,null,null,null,null,null,null,null,null,null,null,null,null,null,null,null,null,null,null,null,null,null,null,null,null,null,null,null,null,null,null,null,null,{"$f":"IF(AI108<>\"\",COUNTA($AI$2:$AI108),\"\")","v":17},"ok",null,"Stachly Marec",1704.0520977880735,"ok","",null,0]
[null,null,null,null,null,null,null,null,null,null,null,null,null,null,null,null,null,null,null,null,null,null,null,null,null,null,null,null,null,null,null,null,null,{"$f":"IF(AI109<>\"\",COUNTA($AI$2:$AI109),\"\")","v":""},null,null,"Stahl Volker","","ok","",null,0]
[null,null,null,null,null,null,null,null,null,null,null,null,null,null,null,null,null,null,null,null,null,null,null,null,null,null,null,null,null,null,null,null,null,{"$f":"IF(AI110<>\"\",COUNTA($AI$2:$AI110),\"\")","v":""},null,null,"Straßberger Martin","",null,"",null,0]
[null,null,null,null,null,null,null,null,null,null,null,null,null,null,null,null,null,null,null,null,null,null,null,null,null,null,null,null,null,null,null,null,null,{"$f":"IF(AI111<>\"\",COUNTA($AI$2:$AI111),\"\")","v":18},"ok",null,"Straßburger Marko",2368.1640029491891,"ok","",null,0]
[null,null,null,null,null,null,null,null,null,null,null,null,null,null,null,null,null,null,null,null,null,null,null,null,null,null,null,null,null,null,null,null,null,{"$f":"IF(AI112<>\"\",COUNTA($AI$2:$AI112),\"\")","v":19},"ok",null,"Suttner Magnus",5420.9641788923018,"ok","",null,0]
[null,null,null,null,null,null,null,null,null,null,null,null,null,null,null,null,null,null,null,null,null,null,null,null,null,null,null,null,null,null,null,null,null,{"$f":"IF(AI113<>\"\",COUNTA($AI$2:$AI113),\"\")","v":20},"ok",null,"Swennen Andy",10266.395200427962,"ok","",null,0]
[null,null,null,null,null,null,null,null,null,null,null,null,null,null,null,null,null,null,null,null,null,null,null,null,null,null,null,null,null,null,null,null,null,{"$f":"IF(AI114<>\"\",COUNTA($AI$2:$AI114),\"\")","v":21},"ok",null,"Thomas Moritz",9665.385739058609,"ok","",null,0]
[null,null,null,null,null,null,null,null,null,null,null,null,null,null,null,null,null,null,null,null,null,null,null,null,null,null,null,null,null,null,null,null,null,{"$f":"IF(AI115<>\"\",COUNTA($AI$2:$AI115),\"\")","v":""},null,null,"Urban Adam","","ok","",null,0]
[null,null,null,null,null,null,null,null,null,null,null,null,null,null,null,null,null,null,null,null,null,null,null,null,null,null,null,null,null,null,null,null,null,{"$f":"IF(AI116<>\"\",COUNTA($AI$2:$AI116),\"\")","v":""},null,null,"Utikal Jan","",null,"",null,0]
[null,null,null,null,null,null,null,null,null,null,null,null,null,null,null,null,null,null,null,null,null,null,null,null,null,null,null,null,null,null,null,null,null,{"$f":"IF(AI117<>\"\",COUNTA($AI$2:$AI117),\"\")","v":22},"ok",null,"Valderrama Salvador",19536.4314694001,"ok","",null,0]
[null,null,null,null,null,null,null,null,null,null,null,null,null,null,null,null,null,null,null,null,null,null,null,null,null,null,null,null,null,null,null,null,null,{"$f":"IF(AI118<>\"\",COUNTA($AI$2:$AI118),\"\")","v":""},null,null,"Vaupel Philipp","",null,"",null,0]
[null,null,null,null,null,null,null,null,null,null,null,null,null,null,null,null,null,null,null,null,null,null,null,null,null,null,null,null,null,null,null,null,null,{"$f":"IF(AI119<>\"\",COUNTA($AI$2:$AI119),\"\")","v":""},null,null,"Veit Timo","","ok","",null,0]
[null,null,null,null,null,null,null,null,null,null,null,null,null,null,null,null,null,null,null,null,null,null,null,null,null,null,null,null,null,null,null,null,null,{"$f":"IF(AI120<>\"\",COUNTA($AI$2:$AI120),\"\")","v":23},"ok",null,"Weber Marco",4697.5569647472512,"ok","",null,0]
[null,null,null,null,null,null,null,null,null,null,null,null,null,null,null,null,null,null,null,null,null,null,null,null,null,null,null,null,null,null,null,null,null,{"$f":"IF(AI121<>\"\",COUNTA($AI$2:$AI121),\"\")","v":""},null,null,"Weber Mats","",null,"",null,0]
[null,null,null,null,null,null,null,null,null,null,null,null,null,null,null,null,null,null,null,null,null,null,null,null,null,null,null,null,null,null,null,null,null,{"$f":"IF(AI122<>\"\",COUNTA($AI$2:$AI122),\"\")","v":""},null,null,"Weber Max","","ok","",null,0]
[null,null,null,null,null,null,null,null,null,null,null,null,null,null,null,null,null,null,null,null,null,null,null,null,null,null,null,null,null,null,null,null,null,{"$f":"IF(AI123<>\"\",COUNTA($AI$2:$AI123),\"\")","v":""},null,null,"Wendelmuth Tino","",null,"",null,0]
[null,null,null,null,null,null,null,null,null,null,null,null,null,null,null,null,null,null,null,null,null,null,null,null,null,null,null,null,null,null,null,null,null,{"$f":"IF(AI124<>\"\",COUNTA($AI$2:$AI124),\"\")","v":24},"ok",null,"Witzik Oliver",19352.370476436445,null,"",null,0]
[null,null,null,null,null,null,null,null,null,null,null,null,null,null,null,null,null,null,null,null,null,null,null,null,null,null,null,null,null,null,null,null,null,{"$f":"IF(AI125<>\"\",COUNTA($AI$2:$AI125),\"\")","v":""},null,null,"x","",null,"",null,0]
[null,null,null,null,null,null,null,null,null,null,null,null,null,null,null,null,null,null,null,null,null,null,null,null,null,null,null,null,null,null,null,null,null,{"$f":"IF(AI126<>\"\",COUNTA($AI$2:$AI126),\"\")","v":""},null,null,"y","",null,"",null,0]
[null,null,null,null,null,null,null,null,null,null,null,null,null,null,null,null,null,null,null,null,null,null,null,null,null,null,null,null,null,null,null,null,null,{"$f":"IF(AI127<>\"\",COUNTA($AI$2:$AI127),\"\")","v":""},null,null,"Yekebasli Abuzer","","ok","",null,0]
[null,null,null,null,null,null,null,null,null,null,null,null,null,null,null,null,null,null,null,null,null,null,null,null,null,null,null,null,null,null,null,null,null,{"$f":"IF(AI128<>\"\",COUNTA($AI$2:$AI128),\"\")","v":""},null,null,"z","",null,"",null,0]
[null,null,null,null,null,null,null,null,null,null,null,null,null,null,null,null,null,null,null,null,null,null,null,null,null,null,null,null,null,null,null,null,null,{"$f":"IF(AI129<>\"\",COUNTA($AI$2:$AI129),\"\")","v":""},null,null,"Zenß Christian","",null,"",null,0]
[null,null,null,null,null,null,null,null,null,null,null,null,null,null,null,null,null,null,null,null,null,null,null,null,null,null,null,null,null,null,null,null,null,{"$f":"IF(AI130<>\"\",COUNTA($AI$2:$AI130),\"\")","v":""},null,null,null,{"$f":"IFERROR(IF(AI130=\"\",\"\",IF(AJ130=\"gesetzt\",RAND()*5000000,RAND()*1000*20)),\"\")","v":""},null,"",null,0]
[null,null,null,null,null,null,null,null,null,null,null,null,null,null,null,null,null,null,null,null,null,null,null,null,null,null,null,null,null,null,null,null,null,{"$f":"IF(AI131<>\"\",COUNTA($AI$2:$AI131),\"\")","v":""},null,null,null,"",null,{"$f":"IF(AJ131=\"\",\"\",AJ131)","v":""},null,{"$f":"IF(AN131=\"gesetzt\",1,0)","v":0}]
[null,null,null,null,null,null,null,null,null,null,null,null,null,null,null,null,null,null,null,null,null,null,null,null,null,null,null,null,null,null,null,null,null,{"$f":"IF(AI132<>\"\",COUNTA($AI$2:$AI132),\"\")","v":""},null,null,null,"",null,"",null,0]
[null,null,null,null,null,null,null,null,null,null,null,null,null,null,null,null,null,null,null,null,null,null,null,null,null,null,null,null,null,null,null,null,null,{"$f":"IF(AI133<>\"\",COUNTA($AI$2:$AI133),\"\")","v":""},null,null,null,"",null,"",null,0]
[null,null,null,null,null,null,null,null,null,null,null,null,null,null,null,null,null,null,null,null,null,null,null,null,null,null,null,null,null,null,null,null,null,{"$f":"IF(AI134<>\"\",COUNTA($AI$2:$AI134),\"\")","v":""},null,null,null,"",null,"",null,0]
[null,null,null,null,null,null,null,null,null,null,null,null,null,null,null,null,null,null,null,null,null,null,null,null,null,null,null,null,null,null,null,null,null,{"$f":"IF(AI135<>\"\",COUNTA($AI$2:$AI135),\"\")","v":""},null,null,null,"",null,"",null,0]
[null,null,null,null,null,null,null,null,null,null,null,null,null,null,null,null,null,null,null,null,null,null,null,null,null,null,null,null,null,null,null,null,null,{"$f":"IF(AI136<>\"\",COUNTA($AI$2:$AI136),\"\")","v":""},null,null,null,"",null,"",null,0]
[null,null,null,null,null,null,null,null,null,null,null,null,null,null,null,null,null,null,null,null,null,null,null,null,null,null,null,null,null,null,null,null,null,{"$f":"IF(AI137<>\"\",COUNTA($AI$2:$AI137),\"\")","v":""},null,null,null,"",null,"",null,0]
[null,null,null,null,null,null,null,null,null,null,null,null,null,null,null,null,null,null,null,null,null,null,null,null,null,null,null,null,null,null,null,null,null,{"$f":"IF(AI138<>\"\",COUNTA($AI$2:$AI138),\"\")","v":""},null,null,null,"",null,"",null,0]
[null,null,null,null,null,null,null,null,null,null,null,null,null,null,null,null,null,null,null,null,null,null,null,null,null,null,null,null,null,null,null,null,null,{"$f":"IF(AI139<>\"\",COUNTA($AI$2:$AI139),\"\")","v":""},null,null,null,"",null,"",null,0]
[null,null,null,null,null,null,null,null,null,null,null,null,null,null,null,null,null,null,null,null,null,null,null,null,null,null,null,null,null,null,null,null,null,{"$f":"IF(AI140<>\"\",COUNTA($AI$2:$AI140),\"\")","v":""},null,null,null,"",null,"",null,0]
[null,null,null,null,null,null,null,null,null,null,null,null,null,null,null,null,null,null,null,null,null,null,null,null,null,null,null,null,null,null,null,null,null,{"$f":"IF(AI141<>\"\",COUNTA($AI$2:$AI141),\"\")","v":""},null,null,null,"",null,"",null,0]
[null,null,null,null,null,null,null,null,null,null,null,null,null,null,null,null,null,null,null,null,null,null,null,null,null,null,null,null,null,null,null,null,null,{"$f":"IF(AI142<>\"\",COUNTA($AI$2:$AI142),\"\")","v":""},null,null,null,"",null,"",null,0]
[null,null,null,null,null,null,null,null,null,null,null,null,null,null,null,null,null,null,null,null,null,null,null,null,null,null,null,null,null,null,null,null,null,{"$f":"IF(AI143<>\"\",COUNTA($AI$2:$AI143),\"\")","v":""},null,null,null,"",null,"",null,0]
[null,null,null,null,null,null,null,null,null,null,null,null,null,null,null,null,null,null,null,null,null,null,null,null,null,null,null,null,null,null,null,null,null,{"$f":"IF(AI144<>\"\",COUNTA($AI$2:$AI144),\"\")","v":""},null,null,null,"",null,"",null,0]
[null,null,null,null,null,null,null,null,null,null,null,null,null,null,null,null,null,null,null,null,null,null,null,null,null,null,null,null,null,null,null,null,null,{"$f":"IF(AI145<>\"\",COUNTA($AI$2:$AI145),\"\")","v":""},null,null,null,"",null,"",null,0]
[null,null,null,null,null,null,null,null,null,null,null,null,null,null,null,null,null,null,null,null,null,null,null,null,null,null,null,null,null,null,null,null,null,{"$f":"IF(AI146<>\"\",COUNTA($AI$2:$AI146),\"\")","v":""},null,null,null,"",null,"",null,0]
[null,null,null,null,null,null,null,null,null,null,null,null,null,null,null,null,null,null,null,null,null,null,null,null,null,null,null,null,null,null,null,null,null,{"$f":"IF(AI147<>\"\",COUNTA($AI$2:$AI147),\"\")","v":""},null,null,null,"",null,"",null,0]
[null,null,null,null,null,null,null,null,null,null,null,null,null,null,null,null,null,null,null,null,null,null,null,null,null,null,null,null,null,null,null,null,null,{"$f":"IF(AI148<>\"\",COUNTA($AI$2:$AI148),\"\")","v":""},null,null,null,"",null,"",null,0]
[null,null,null,null,null,null,null,null,null,null,null,null,null,null,null,null,null,null,null,null,null,null,null,null,null,null,null,null,null,null,null,null,null,{"$f":"IF(AI149<>\"\",COUNTA($AI$2:$AI149),\"\")","v":""},null,null,null,"",null,"",null,0]
[null,null,null,null,null,null,null,null,null,null,null,null,null,null,null,null,null,null,null,null,null,null,null,null,null,null,null,null,null,null,null,null,null,{"$f":"IF(AI150<>\"\",COUNTA($AI$2:$AI150),\"\")","v":""},null,null,null,"",null,"",null,0]
[null,null,null,null,null,null,null,null,null,null,null,null,null,null,null,null,null,null,null,null,null,null,null,null,null,null,null,null,null,null,null,null,null,{"$f":"IF(AI151<>\"\",COUNTA($AI$2:$AI151),\"\")","v":""},null,null,null,"",null,"",null,0]
[null,null,null,null,null,null,null,null,null,null,null,null,null,null,null,null,null,null,null,null,null,null,null,null,null,null,null,null,null,null,null,null,null,{"$f":"IF(AI152<>\"\",COUNTA($AI$2:$AI152),\"\")","v":""},null,null,null,"",null,"",null,0]
[null,null,null,null,null,null,null,null,null,null,null,null,null,null,null,null,null,null,null,null,null,null,null,null,null,null,null,null,null,null,null,null,null,{"$f":"IF(AI153<>\"\",COUNTA($AI$2:$AI153),\"\")","v":""},null,null,null,"",null,"",null,0]
[null,null,null,null,null,null,null,null,null,null,null,null,null,null,null,null,null,null,null,null,null,null,null,null,null,null,null,null,null,null,null,null,null,{"$f":"IF(AI154<>\"\",COUNTA($AI$2:$AI154),\"\")","v":""},null,null,null,"",null,"",null,0]
[null,null,null,null,null,null,null,null,null,null,null,null,null,null,null,null,null,null,null,null,null,null,null,null,null,null,null,null,null,null,null,null,null,{"$f":"IF(AI155<>\"\",COUNTA($AI$2:$AI155),\"\")","v":""},null,null,null,"",null,"",null,0]
[null,null,null,null,null,null,null,null,null,null,null,null,null,null,null,null,null,null,null,null,null,null,null,null,null,null,null,null,null,null,null,null,null,{"$f":"IF(AI156<>\"\",COUNTA($AI$2:$AI156),\"\")","v":""},null,null,null,"",null,"",null,0]
[null,null,null,null,null,null,null,null,null,null,null,null,null,null,null,null,null,null,null,null,null,null,null,null,null,null,null,null,null,null,null,null,null,{"$f":"IF(AI157<>\"\",COUNTA($AI$2:$AI157),\"\")","v":""},null,null,null,"",null,"",null,0]
[null,null,null,null,null,null,null,null,null,null,null,null,null,null,null,null,null,null,null,null,null,null,null,null,null,null,null,null,null,null,null,null,null,{"$f":"IF(AI158<>\"\",COUNTA($AI$2:$AI158),\"\")","v":""},null,null,null,"",null,"",null,0]
[null,null,null,null,null,null,null,null,null,null,null,null,null,null,null,null,null,null,null,null,null,null,null,null,null,null,null,null,null,null,null,null,null,{"$f":"IF(AI159<>\"\",COUNTA($AI$2:$AI159),\"\")","v":""},null,null,null,"",null,"",null,0]
[null,null,null,null,null,null,null,null,null,null,null,null,null,null,null,null,null,null,null,null,null,null,null,null,null,null,null,null,null,null,null,null,null,{"$f":"IF(AI160<>\"\",COUNTA($AI$2:$AI160),\"\")","v":""},null,null,null,"",null,"",null,0]
[null,null,null,null,null,null,null,null,null,null,null,null,null,null,null,null,null,null,null,null,null,null,null,null,null,null,null,null,null,null,null,null,null,{"$f":"IF(AI161<>\"\",COUNTA($AI$2:$AI161),\"\")","v":""},null,null,null,"",null,"",null,0]
[null,null,null,null,null,null,null,null,null,null,null,null,null,null,null,null,null,null,null,null,null,null,null,null,null,null,null,null,null,null,null,null,null,{"$f":"IF(AI162<>\"\",COUNTA($AI$2:$AI162),\"\")","v":""},null,null,null,"",null,"",null,0]
[null,null,null,null,null,null,null,null,null,null,null,null,null,null,null,null,null,null,null,null,null,null,null,null,null,null,null,null,null,null,null,null,null,{"$f":"IF(AI163<>\"\",COUNTA($AI$2:$AI163),\"\")","v":""},null,null,null,"",null,"",null,0]
[null,null,null,null,null,null,null,null,null,null,null,null,null,null,null,null,null,null,null,null,null,null,null,null,null,null,null,null,null,null,null,null,null,{"$f":"IF(AI164<>\"\",COUNTA($AI$2:$AI164),\"\")","v":""},null,null,null,"",null,"",null,0]
[null,null,null,null,null,null,null,null,null,null,null,null,null,null,null,null,null,null,null,null,null,null,null,null,null,null,null,null,null,null,null,null,null,{"$f":"IF(AI165<>\"\",COUNTA($AI$2:$AI165),\"\")","v":""},null,null,null,"",null,"",null,0]
[null,null,null,null,null,null,null,null,null,null,null,null,null,null,null,null,null,null,null,null,null,null,null,null,null,null,null,null,null,null,null,null,null,{"$f":"IF(AI166<>\"\",COUNTA($AI$2:$AI166),\"\")","v":""},null,null,null,"",null,"",null,0]
[null,null,null,null,null,null,null,null,null,null,null,null,null,null,null,null,null,null,null,null,null,null,null,null,null,null,null,null,null,null,null,null,null,{"$f":"IF(AI167<>\"\",COUNTA($AI$2:$AI167),\"\")","v":""},null,null,null,"",null,"",null,0]
[null,null,null,null,null,null,null,null,null,null,null,null,null,null,null,null,null,null,null,null,null,null,null,null,null,null,null,null,null,null,null,null,null,{"$f":"IF(AI168<>\"\",COUNTA($AI$2:$AI168),\"\")","v":""},null,null,null,"",null,"",null,0]
[null,null,null,null,null,null,null,null,null,null,null,null,null,null,null,null,null,null,null,null,null,null,null,null,null,null,null,null,null,null,null,null,null,{"$f":"IF(AI169<>\"\",COUNTA($AI$2:$AI169),\"\")","v":""},null,null,null,"",null,"",null,0]
[null,null,null,null,null,null,null,null,null,null,null,null,null,null,null,null,null,null,null,null,null,null,null,null,null,null,null,null,null,null,null,null,null,{"$f":"IF(AI170<>\"\",COUNTA($AI$2:$AI170),\"\")","v":""},null,null,null,"",null,"",null,0]
[null,null,null,null,null,null,null,null,null,null,null,null,null,null,null,null,null,null,null,null,null,null,null,null,null,null,null,null,null,null,null,null,null,{"$f":"IF(AI171<>\"\",COUNTA($AI$2:$AI171),\"\")","v":""},null,null,null,"",null,"",null,0]
[null,null,null,null,null,null,null,null,null,null,null,null,null,null,null,null,null,null,null,null,null,null,null,null,null,null,null,null,null,null,null,null,null,{"$f":"IF(AI172<>\"\",COUNTA($AI$2:$AI172),\"\")","v":""},null,null,null,"",null,"",null,0]
[null,null,null,null,null,null,null,null,null,null,null,null,null,null,null,null,null,null,null,null,null,null,null,null,null,null,null,null,null,null,null,null,null,{"$f":"IF(AI173<>\"\",COUNTA($AI$2:$AI173),\"\")","v":""},null,null,null,"",null,"",null,0]
[null,null,null,null,null,null,null,null,null,null,null,null,null,null,null,null,null,null,null,null,null,null,null,null,null,null,null,null,null,null,null,null,null,{"$f":"IF(AI174<>\"\",COUNTA($AI$2:$AI174),\"\")","v":""},null,null,null,"",null,"",null,0]
[null,null,null,null,null,null,null,null,null,null,null,null,null,null,null,null,null,null,null,null,null,null,null,null,null,null,null,null,null,null,null,null,null,{"$f":"IF(AI175<>\"\",COUNTA($AI$2:$AI175),\"\")","v":""},null,null,null,"",null,"",null,0]
[null,null,null,null,null,null,null,null,null,null,null,null,null,null,null,null,null,null,null,null,null,null,null,null,null,null,null,null,null,null,null,null,null,{"$f":"IF(AI176<>\"\",COUNTA($AI$2:$AI176),\"\")","v":""},null,null,null,"",null,"",null,0]
[null,null,null,null,null,null,null,null,null,null,null,null,null,null,null,null,null,null,null,null,null,null,null,null,null,null,null,null,null,null,null,null,null,{"$f":"IF(AI177<>\"\",COUNTA($AI$2:$AI177),\"\")","v":""},null,null,null,"",null,"",null,0]
[null,null,null,null,null,null,null,null,null,null,null,null,null,null,null,null,null,null,null,null,null,null,null,null,null,null,null,null,null,null,null,null,null,{"$f":"IF(AI178<>\"\",COUNTA($AI$2:$AI178),\"\")","v":""},null,null,null,"",null,"",null,0]
[null,null,null,null,null,null,null,null,null,null,null,null,null,null,null,null,null,null,null,null,null,null,null,null,null,null,null,null,null,null,null,null,null,{"$f":"IF(AI179<>\"\",COUNTA($AI$2:$AI179),\"\")","v":""},null,null,null,"",null,"",null,0]
[null,null,null,null,null,null,null,null,null,null,null,null,null,null,null,null,null,null,null,null,null,null,null,null,null,null,null,null,null,null,null,null,null,{"$f":"IF(AI180<>\"\",COUNTA($AI$2:$AI180),\"\")","v":""},null,null,null,"",null,"",null,0]
[null,null,null,null,null,null,null,null,null,null,null,null,null,null,null,null,null,null,null,null,null,null,null,null,null,null,null,null,null,null,null,null,null,{"$f":"IF(AI181<>\"\",COUNTA($AI$2:$AI181),\"\")","v":""},null,null,null,"",null,"",null,0]
[null,null,null,null,null,null,null,null,null,null,null,null,null,null,null,null,null,null,null,null,null,null,null,null,null,null,null,null,null,null,null,null,null,{"$f":"IF(AI182<>\"\",COUNTA($AI$2:$AI182),\"\")","v":""},null,null,null,"",null,"",null,0]
[null,null,null,null,null,null,null,null,null,null,null,null,null,null,null,null,null,null,null,null,null,null,null,null,null,null,null,null,null,null,null,null,null,{"$f":"IF(AI183<>\"\",COUNTA($AI$2:$AI183),\"\")","v":""},null,null,null,"",null,"",null,0]
[null,null,null,null,null,null,null,null,null,null,null,null,null,null,null,null,null,null,null,null,null,null,null,null,null,null,null,null,null,null,null,null,null,{"$f":"IF(AI184<>\"\",COUNTA($AI$2:$AI184),\"\")","v":""},null,null,null,"",null,"",null,0]
[null,null,null,null,null,null,null,null,null,null,null,null,null,null,null,null,null,null,null,null,null,null,null,null,null,null,null,null,null,null,null,null,null,{"$f":"IF(AI185<>\"\",COUNTA($AI$2:$AI185),\"\")","v":""},null,null,null,"",null,"",null,0]
[null,null,null,null,null,null,null,null,null,null,null,null,null,null,null,null,null,null,null,null,null,null,null,null,null,null,null,null,null,null,null,null,null,{"$f":"IF(AI186<>\"\",COUNTA($AI$2:$AI186),\"\")","v":""},null,null,null,"",null,"",null,0]
[null,null,null,null,null,null,null,null,null,null,null,null,null,null,null,null,null,null,null,null,null,null,null,null,null,null,null,null,null,null,null,null,null,{"$f":"IF(AI187<>\"\",COUNTA($AI$2:$AI187),\"\")","v":""},null,null,null,"",null,"",null,0]
[null,null,null,null,null,null,null,null,null,null,null,null,null,null,null,null,null,null,null,null,null,null,null,null,null,null,null,null,null,null,null,null,null,{"$f":"IF(AI188<>\"\",COUNTA($AI$2:$AI188),\"\")","v":""},null,null,null,"",null,"",null,0]
[null,null,null,null,null,null,null,null,null,null,null,null,null,null,null,null,null,null,null,null,null,null,null,null,null,null,null,null,null,null,null,null,null,{"$f":"IF(AI189<>\"\",COUNTA($AI$2:$AI189),\"\")","v":""},null,null,null,"",null,"",null,0]
[null,null,null,null,null,null,null,null,null,null,null,null,null,null,null,null,null,null,null,null,null,null,null,null,null,null,null,null,null,null,null,null,null,{"$f":"IF(AI190<>\"\",COUNTA($AI$2:$AI190),\"\")","v":""},null,null,null,"",null,"",null,0]
[null,null,null,null,null,null,null,null,null,null,null,null,null,null,null,null,null,null,null,null,null,null,null,null,null,null,null,null,null,null,null,null,null,{"$f":"IF(AI191<>\"\",COUNTA($AI$2:$AI191),\"\")","v":""},null,null,null,"",null,"",null,0]
[null,null,null,null,null,null,null,null,null,null,null,null,null,null,null,null,null,null,null,null,null,null,null,null,null,null,null,null,null,null,null,null,null,{"$f":"IF(AI192<>\"\",COUNTA($AI$2:$AI192),\"\")","v":""},null,null,null,"",null,"",null,0]
[null,null,null,null,null,null,null,null,null,null,null,null,null,null,null,null,null,null,null,null,null,null,null,null,null,null,null,null,null,null,null,null,null,{"$f":"IF(AI193<>\"\",COUNTA($AI$2:$AI193),\"\")","v":""},null,null,null,"",null,"",null,0]
[null,null,null,null,null,null,null,null,null,null,null,null,null,null,null,null,null,null,null,null,null,null,null,null,null,null,null,null,null,null,null,null,null,{"$f":"IF(AI194<>\"\",COUNTA($AI$2:$AI194),\"\")","v":""},null,null,null,{"$f":"IFERROR(IF(AI194=\"\",\"\",IF(AJ194=\"gesetzt\",RAND()*5000000,RAND()*1000*20)),\"\")","v":""},null,"",null,0]
[null,null,null,null,null,null,null,null,null,null,null,null,null,null,null,null,null,null,null,null,null,null,null,null,null,null,null,null,null,null,null,null,null,{"$f":"IF(AI195<>\"\",COUNTA($AI$2:$AI195),\"\")","v":""},null,null,null,"",null,{"$f":"IF(AJ195=\"\",\"\",AJ195)","v":""},null,{"$f":"IF(AN195=\"gesetzt\",1,0)","v":0}]
[null,null,null,null,null,null,null,null,null,null,null,null,null,null,null,null,null,null,null,null,null,null,null,null,null,null,null,null,null,null,null,null,null,{"$f":"IF(AI196<>\"\",COUNTA($AI$2:$AI196),\"\")","v":""},null,null,null,"",null,"",null,0]
[null,null,null,null,null,null,null,null,null,null,null,null,null,null,null,null,null,null,null,null,null,null,null,null,null,null,null,null,null,null,null,null,null,{"$f":"IF(AI197<>\"\",COUNTA($AI$2:$AI197),\"\")","v":""},null,null,null,"",null,"",null,0]
[null,null,null,null,null,null,null,null,null,null,null,null,null,null,null,null,null,null,null,null,null,null,null,null,null,null,null,null,null,null,null,null,null,{"$f":"IF(AI198<>\"\",COUNTA($AI$2:$AI198),\"\")","v":""},null,null,null,"",null,"",null,0]
[null,null,null,null,null,null,null,null,null,null,null,null,null,null,null,null,null,null,null,null,null,null,null,null,null,null,null,null,null,null,null,null,null,{"$f":"IF(AI199<>\"\",COUNTA($AI$2:$AI199),\"\")","v":""},null,null,null,"",null,"",null,0]
[null,null,null,null,null,null,null,null,null,null,null,null,null,null,null,null,null,null,null,null,null,null,null,null,null,null,null,null,null,null,null,null,null,{"$f":"IF(AI200<>\"\",COUNTA($AI$2:$AI200),\"\")","v":""},null,null,null,"",null,"",null,0]
[null,null,null,null,null,null,null,null,null,null,null,null,null,null,null,null,null,null,null,null,null,null,null,null,null,null,null,null,null,null,null,null,null,{"$f":"IF(AI201<>\"\",COUNTA($AI$2:$AI201),\"\")","v":""},null,null,null,"",null,"",null,0]
[null,null,null,null,null,null,null,null,null,null,null,null,null,null,null,null,null,null,null,null,null,null,null,null,null,null,null,null,null,null,null,null,null,{"$f":"IF(AI202<>\"\",COUNTA($AI$2:$AI202),\"\")","v":""},null,null,null,"",null,"",null,0]
[null,null,null,null,null,null,null,null,null,null,null,null,null,null,null,null,null,null,null,null,null,null,null,null,null,null,null,null,null,null,null,null,null,{"$f":"IF(AI203<>\"\",COUNTA($AI$2:$AI203),\"\")","v":""},null,null,null,"",null,"",null,0]
[null,null,null,null,null,null,null,null,null,null,null,null,null,null,null,null,null,null,null,null,null,null,null,null,null,null,null,null,null,null,null,null,null,{"$f":"IF(AI204<>\"\",COUNTA($AI$2:$AI204),\"\")","v":""},null,null,null,"",null,"",null,0]
[null,null,null,null,null,null,null,null,null,null,null,null,null,null,null,null,null,null,null,null,null,null,null,null,null,null,null,null,null,null,null,null,null,{"$f":"IF(AI205<>\"\",COUNTA($AI$2:$AI205),\"\")","v":""},null,null,null,"",null,"",null,0]
[null,null,null,null,null,null,null,null,null,null,null,null,null,null,null,null,null,null,null,null,null,null,null,null,null,null,null,null,null,null,null,null,null,{"$f":"IF(AI206<>\"\",COUNTA($AI$2:$AI206),\"\")","v":""},null,null,null,"",null,"",null,0]
[null,null,null,null,null,null,null,null,null,null,null,null,null,null,null,null,null,null,null,null,null,null,null,null,null,null,null,null,null,null,null,null,null,{"$f":"IF(AI207<>\"\",COUNTA($AI$2:$AI207),\"\")","v":""},null,null,null,"",null,"",null,0]
[null,null,null,null,null,null,null,null,null,null,null,null,null,null,null,null,null,null,null,null,null,null,null,null,null,null,null,null,null,null,null,null,null,{"$f":"IF(AI208<>\"\",COUNTA($AI$2:$AI208),\"\")","v":""},null,null,null,"",null,"",null,0]
[null,null,null,null,null,null,null,null,null,null,null,null,null,null,null,null,null,null,null,null,null,null,null,null,null,null,null,null,null,null,null,null,null,{"$f":"IF(AI209<>\"\",COUNTA($AI$2:$AI209),\"\")","v":""},null,null,null,"",null,"",null,0]
[null,null,null,null,null,null,null,null,null,null,null,null,null,null,null,null,null,null,null,null,null,null,null,null,null,null,null,null,null,null,null,null,null,{"$f":"IF(AI210<>\"\",COUNTA($AI$2:$AI210),\"\")","v":""},null,null,null,"",null,"",null,0]
[null,null,null,null,null,null,null,null,null,null,null,null,null,null,null,null,null,null,null,null,null,null,null,null,null,null,null,null,null,null,null,null,null,{"$f":"IF(AI211<>\"\",COUNTA($AI$2:$AI211),\"\")","v":""},null,null,null,"",null,"",null,0]
[null,null,null,null,null,null,null,null,null,null,null,null,null,null,null,null,null,null,null,null,null,null,null,null,null,null,null,null,null,null,null,null,null,{"$f":"IF(AI212<>\"\",COUNTA($AI$2:$AI212),\"\")","v":""},null,null,null,"",null,"",null,0]
[null,null,null,null,null,null,null,null,null,null,null,null,null,null,null,null,null,null,null,null,null,null,null,null,null,null,null,null,null,null,null,null,null,{"$f":"IF(AI213<>\"\",COUNTA($AI$2:$AI213),\"\")","v":""},null,null,null,"",null,"",null,0]
[null,null,null,null,null,null,null,null,null,null,null,null,null,null,null,null,null,null,null,null,null,null,null,null,null,null,null,null,null,null,null,null,null,{"$f":"IF(AI214<>\"\",COUNTA($AI$2:$AI214),\"\")","v":""},null,null,null,"",null,"",null,0]
[null,null,null,null,null,null,null,null,null,null,null,null,null,null,null,null,null,null,null,null,null,null,null,null,null,null,null,null,null,null,null,null,null,{"$f":"IF(AI215<>\"\",COUNTA($AI$2:$AI215),\"\")","v":""},null,null,null,"",null,"",null,0]
[null,null,null,null,null,null,null,null,null,null,null,null,null,null,null,null,null,null,null,null,null,null,null,null,null,null,null,null,null,null,null,null,null,{"$f":"IF(AI216<>\"\",COUNTA($AI$2:$AI216),\"\")","v":""},null,null,null,"",null,"",null,0]
[null,null,null,null,null,null,null,null,null,null,null,null,null,null,null,null,null,null,null,null,null,null,null,null,null,null,null,null,null,null,null,null,null,{"$f":"IF(AI217<>\"\",COUNTA($AI$2:$AI217),\"\")","v":""},null,null,null,"",null,"",null,0]
[null,null,null,null,null,null,null,null,null,null,null,null,null,null,null,null,null,null,null,null,null,null,null,null,null,null,null,null,null,null,null,null,null,{"$f":"IF(AI218<>\"\",COUNTA($AI$2:$AI218),\"\")","v":""},null,null,null,"",null,"",null,0]
[null,null,null,null,null,null,null,null,null,null,null,null,null,null,null,null,null,null,null,null,null,null,null,null,null,null,null,null,null,null,null,null,null,{"$f":"IF(AI219<>\"\",COUNTA($AI$2:$AI219),\"\")","v":""},null,null,null,"",null,"",null,0]
[null,null,null,null,null,null,null,null,null,null,null,null,null,null,null,null,null,null,null,null,null,null,null,null,null,null,null,null,null,null,null,null,null,{"$f":"IF(AI220<>\"\",COUNTA($AI$2:$AI220),\"\")","v":""},null,null,null,"",null,"",null,0]
[null,null,null,null,null,null,null,null,null,null,null,null,null,null,null,null,null,null,null,null,null,null,null,null,null,null,null,null,null,null,null,null,null,{"$f":"IF(AI221<>\"\",COUNTA($AI$2:$AI221),\"\")","v":""},null,null,null,"",null,"",null,0]
[null,null,null,null,null,null,null,null,null,null,null,null,null,null,null,null,null,null,null,null,null,null,null,null,null,null,null,null,null,null,null,null,null,{"$f":"IF(AI222<>\"\",COUNTA($AI$2:$AI222),\"\")","v":""},null,null,null,"",null,"",null,0]
[null,null,null,null,null,null,null,null,null,null,null,null,null,null,null,null,null,null,null,null,null,null,null,null,null,null,null,null,null,null,null,null,null,{"$f":"IF(AI223<>\"\",COUNTA($AI$2:$AI223),\"\")","v":""},null,null,null,"",null,"",null,0]
[null,null,null,null,null,null,null,null,null,null,null,null,null,null,null,null,null,null,null,null,null,null,null,null,null,null,null,null,null,null,null,null,null,{"$f":"IF(AI224<>\"\",COUNTA($AI$2:$AI224),\"\")","v":""},null,null,null,"",null,"",null,0]
[null,null,null,null,null,null,null,null,null,null,null,null,null,null,null,null,null,null,null,null,null,null,null,null,null,null,null,null,null,null,null,null,null,{"$f":"IF(AI225<>\"\",COUNTA($AI$2:$AI225),\"\")","v":""},null,null,null,"",null,"",null,0]
[null,null,null,null,null,null,null,null,null,null,null,null,null,null,null,null,null,null,null,null,null,null,null,null,null,null,null,null,null,null,null,null,null,{"$f":"IF(AI226<>\"\",COUNTA($AI$2:$AI226),\"\")","v":""},null,null,null,"",null,"",null,0]
[null,null,null,null,null,null,null,null,null,null,null,null,null,null,null,null,null,null,null,null,null,null,null,null,null,null,null,null,null,null,null,null,null,{"$f":"IF(AI227<>\"\",COUNTA($AI$2:$AI227),\"\")","v":""},null,null,null,"",null,"",null,0]
[null,null,null,null,null,null,null,null,null,null,null,null,null,null,null,null,null,null,null,null,null,null,null,null,null,null,null,null,null,null,null,null,null,{"$f":"IF(AI228<>\"\",COUNTA($AI$2:$AI228),\"\")","v":""},null,null,null,"",null,"",null,0]
[null,null,null,null,null,null,null,null,null,null,null,null,null,null,null,null,null,null,null,null,null,null,null,null,null,null,null,null,null,null,null,null,null,{"$f":"IF(AI229<>\"\",COUNTA($AI$2:$AI229),\"\")","v":""},null,null,null,"",null,"",null,0]
[null,null,null,null,null,null,null,null,null,null,null,null,null,null,null,null,null,null,null,null,null,null,null,null,null,null,null,null,null,null,null,null,null,{"$f":"IF(AI230<>\"\",COUNTA($AI$2:$AI230),\"\")","v":""},null,null,null,"",null,"",null,0]
[null,null,null,null,null,null,null,null,null,null,null,null,null,null,null,null,null,null,null,null,null,null,null,null,null,null,null,null,null,null,null,null,null,{"$f":"IF(AI231<>\"\",COUNTA($AI$2:$AI231),\"\")","v":""},null,null,null,"",null,"",null,0]
[null,null,null,null,null,null,null,null,null,null,null,null,null,null,null,null,null,null,null,null,null,null,null,null,null,null,null,null,null,null,null,null,null,{"$f":"IF(AI232<>\"\",COUNTA($AI$2:$AI232),\"\")","v":""},null,null,null,"",null,"",null,0]
[null,null,null,null,null,null,null,null,null,null,null,null,null,null,null,null,null,null,null,null,null,null,null,null,null,null,null,null,null,null,null,null,null,{"$f":"IF(AI233<>\"\",COUNTA($AI$2:$AI233),\"\")","v":""},null,null,null,"",null,"",null,0]
[null,null,null,null,null,null,null,null,null,null,null,null,null,null,null,null,null,null,null,null,null,null,null,null,null,null,null,null,null,null,null,null,null,{"$f":"IF(AI234<>\"\",COUNTA($AI$2:$AI234),\"\")","v":""},null,null,null,"",null,"",null,0]
[null,null,null,null,null,null,null,null,null,null,null,null,null,null,null,null,null,null,null,null,null,null,null,null,null,null,null,null,null,null,null,null,null,{"$f":"IF(AI235<>\"\",COUNTA($AI$2:$AI235),\"\")","v":""},null,null,null,"",null,"",null,0]
[null,null,null,null,null,null,null,null,null,null,null,null,null,null,null,null,null,null,null,null,null,null,null,null,null,null,null,null,null,null,null,null,null,{"$f":"IF(AI236<>\"\",COUNTA($AI$2:$AI236),\"\")","v":""},null,null,null,"",null,"",null,0]
[null,null,null,null,null,null,null,null,null,null,null,null,null,null,null,null,null,null,null,null,null,null,null,null,null,null,null,null,null,null,null,null,null,{"$f":"IF(AI237<>\"\",COUNTA($AI$2:$AI237),\"\")","v":""},null,null,null,"",null,"",null,0]
[null,null,null,null,null,null,null,null,null,null,null,null,null,null,null,null,null,null,null,null,null,null,null,null,null,null,null,null,null,null,null,null,null,{"$f":"IF(AI238<>\"\",COUNTA($AI$2:$AI238),\"\")","v":""},null,null,null,"",null,"",null,0]
[null,null,null,null,null,null,null,null,null,null,null,null,null,null,null,null,null,null,null,null,null,null,null,null,null,null,null,null,null,null,null,null,null,{"$f":"IF(AI239<>\"\",COUNTA($AI$2:$AI239),\"\")","v":""},null,null,null,"",null,"",null,0]
[null,null,null,null,null,null,null,null,null,null,null,null,null,null,null,null,null,null,null,null,null,null,null,null,null,null,null,null,null,null,null,null,null,{"$f":"IF(AI240<>\"\",COUNTA($AI$2:$AI240),\"\")","v":""},null,null,null,"",null,"",null,0]
[null,null,null,null,null,null,null,null,null,null,null,null,null,null,null,null,null,null,null,null,null,null,null,null,null,null,null,null,null,null,null,null,null,{"$f":"IF(AI241<>\"\",COUNTA($AI$2:$AI241),\"\")","v":""},null,null,null,"",null,"",null,0]
[null,null,null,null,null,null,null,null,null,null,null,null,null,null,null,null,null,null,null,null,null,null,null,null,null,null,null,null,null,null,null,null,null,{"$f":"IF(AI242<>\"\",COUNTA($AI$2:$AI242),\"\")","v":""},null,null,null,"",null,"",null,0]
[null,null,null,null,null,null,null,null,null,null,null,null,null,null,null,null,null,null,null,null,null,null,null,null,null,null,null,null,null,null,null,null,null,{"$f":"IF(AI243<>\"\",COUNTA($AI$2:$AI243),\"\")","v":""},null,null,null,"",null,"",null,0]
[null,null,null,null,null,null,null,null,null,null,null,null,null,null,null,null,null,null,null,null,null,null,null,null,null,null,null,null,null,null,null,null,null,{"$f":"IF(AI244<>\"\",COUNTA($AI$2:$AI244),\"\")","v":""},null,null,null,"",null,"",null,0]
[null,null,null,null,null,null,null,null,null,null,null,null,null,null,null,null,null,null,null,null,null,null,null,null,null,null,null,null,null,null,null,null,null,{"$f":"IF(AI245<>\"\",COUNTA($AI$2:$AI245),\"\")","v":""},null,null,null,"",null,"",null,0]
[null,null,null,null,null,null,null,null,null,null,null,null,null,null,null,null,null,null,null,null,null,null,null,null,null,null,null,null,null,null,null,null,null,{"$f":"IF(AI246<>\"\",COUNTA($AI$2:$AI246),\"\")","v":""},null,null,null,"",null,"",null,0]
[null,null,null,null,null,null,null,null,null,null,null,null,null,null,null,null,null,null,null,null,null,null,null,null,null,null,null,null,null,null,null,null,null,{"$f":"IF(AI247<>\"\",COUNTA($AI$2:$AI247),\"\")","v":""},null,null,null,"",null,"",null,0]
[null,null,null,null,null,null,null,null,null,null,null,null,null,null,null,null,null,null,null,null,null,null,null,null,null,null,null,null,null,null,null,null,null,{"$f":"IF(AI248<>\"\",COUNTA($AI$2:$AI248),\"\")","v":""},null,null,null,"",null,"",null,0]
[null,null,null,null,null,null,null,null,null,null,null,null,null,null,null,null,null,null,null,null,null,null,null,null,null,null,null,null,null,null,null,null,null,{"$f":"IF(AI249<>\"\",COUNTA($AI$2:$AI249),\"\")","v":""},null,null,null,"",null,"",null,0]
[null,null,null,null,null,null,null,null,null,null,null,null,null,null,null,null,null,null,null,null,null,null,null,null,null,null,null,null,null,null,null,null,null,{"$f":"IF(AI250<>\"\",COUNTA($AI$2:$AI250),\"\")","v":""},null,null,null,"",null,"",null,0]
[null,null,null,null,null,null,null,null,null,null,null,null,null,null,null,null,null,null,null,null,null,null,null,null,null,null,null,null,null,null,null,null,null,{"$f":"IF(AI251<>\"\",COUNTA($AI$2:$AI251),\"\")","v":""},null,null,null,"",null,"",null,0]
[null,null,null,null,null,null,null,null,null,null,null,null,null,null,null,null,null,null,null,null,null,null,null,null,null,null,null,null,null,null,null,null,null,{"$f":"IF(AI252<>\"\",COUNTA($AI$2:$AI252),\"\")","v":""},null,null,null,"",null,"",null,0]
[null,null,null,null,null,null,null,null,null,null,null,null,null,null,null,null,null,null,null,null,null,null,null,null,null,null,null,null,null,null,null,null,null,{"$f":"IF(AI253<>\"\",COUNTA($AI$2:$AI253),\"\")","v":""},null,null,null,"",null,"",null,0]
[null,null,null,null,null,null,null,null,null,null,null,null,null,null,null,null,null,null,null,null,null,null,null,null,null,null,null,null,null,null,null,null,null,{"$f":"IF(AI254<>\"\",COUNTA($AI$2:$AI254),\"\")","v":""},null,null,null,"",null,"",null,0]
[null,null,null,null,null,null,null,null,null,null,null,null,null,null,null,null,null,null,null,null,null,null,null,null,null,null,null,null,null,null,null,null,null,{"$f":"IF(AI255<>\"\",COUNTA($AI$2:$AI255),\"\")","v":""},null,null,null,"",null,"",null,0]
[null,null,null,null,null,null,null,null,null,null,null,null,null,null,null,null,null,null,null,null,null,null,null,null,null,null,null,null,null,null,null,null,null,{"$f":"IF(AI256<>\"\",COUNTA($AI$2:$AI256),\"\")","v":""},null,null,null,"",null,"",null,0]
[null,null,null,null,null,null,null,null,null,null,null,null,null,null,null,null,null,null,null,null,null,null,null,null,null,null,null,null,null,null,null,null,null,{"$f":"IF(AI257<>\"\",COUNTA($AI$2:$AI257),\"\")","v":""},null,null,null,"",null,"",null,0]
[null,null,null,null,null,null,null,null,null,null,null,null,null,null,null,null,null,null,null,null,null,null,null,null,null,null,null,null,null,null,null,null,null,{"$f":"IF(AI258<>\"\",COUNTA($AI$2:$AI258),\"\")","v":""},null,null,null,{"$f":"IFERROR(IF(AI258=\"\",\"\",IF(AJ258=\"gesetzt\",RAND()*5000000,RAND()*1000*20)),\"\")","v":""},null,"",null,0]
[null,null,null,null,null,null,null,null,null,null,null,null,null,null,null,null,null,null,null,null,null,null,null,null,null,null,null,null,null,null,null,null,null,{"$f":"IF(AI259<>\"\",COUNTA($AI$2:$AI259),\"\")","v":""},null,null,null,"",null,{"$f":"IF(AJ259=\"\",\"\",AJ259)","v":""},null,{"$f":"IF(AN259=\"gesetzt\",1,0)","v":0}]
[null,null,null,null,null,null,null,null,null,null,null,null,null,null,null,null,null,null,null,null,null,null,null,null,null,null,null,null,null,null,null,null,null,{"$f":"IF(AI260<>\"\",COUNTA($AI$2:$AI260),\"\")","v":""},null,null,null,"",null,"",null,0]
[null,null,null,null,null,null,null,null,null,null,null,null,null,null,null,null,null,null,null,null,null,null,null,null,null,null,null,null,null,null,null,null,null,{"$f":"IF(AI261<>\"\",COUNTA($AI$2:$AI261),\"\")","v":""},null,null,null,"",null,"",null,0]
[null,null,null,null,null,null,null,null,null,null,null,null,null,null,null,null,null,null,null,null,null,null,null,null,null,null,null,null,null,null,null,null,null,{"$f":"IF(AI262<>\"\",COUNTA($AI$2:$AI262),\"\")","v":""},null,null,null,"",null,"",null,0]
[null,null,null,null,null,null,null,null,null,null,null,null,null,null,null,null,null,null,null,null,null,null,null,null,null,null,null,null,null,null,null,null,null,{"$f":"IF(AI263<>\"\",COUNTA($AI$2:$AI263),\"\")","v":""},null,null,null,"",null,"",null,0]
[null,null,null,null,null,null,null,null,null,null,null,null,null,null,null,null,null,null,null,null,null,null,null,null,null,null,null,null,null,null,null,null,null,{"$f":"IF(AI264<>\"\",COUNTA($AI$2:$AI264),\"\")","v":""},null,null,null,"",null,"",null,0]
[null,null,null,null,null,null,null,null,null,null,null,null,null,null,null,null,null,null,null,null,null,null,null,null,null,null,null,null,null,null,null,null,null,{"$f":"IF(AI265<>\"\",COUNTA($AI$2:$AI265),\"\")","v":""},null,null,null,"",null,"",null,0]
[null,null,null,null,null,null,null,null,null,null,null,null,null,null,null,null,null,null,null,null,null,null,null,null,null,null,null,null,null,null,null,null,null,{"$f":"IF(AI266<>\"\",COUNTA($AI$2:$AI266),\"\")","v":""},null,null,null,"",null,"",null,0]
[null,null,null,null,null,null,null,null,null,null,null,null,null,null,null,null,null,null,null,null,null,null,null,null,null,null,null,null,null,null,null,null,null,{"$f":"IF(AI267<>\"\",COUNTA($AI$2:$AI267),\"\")","v":""},null,null,null,"",null,"",null,0]
[null,null,null,null,null,null,null,null,null,null,null,null,null,null,null,null,null,null,null,null,null,null,null,null,null,null,null,null,null,null,null,null,null,{"$f":"IF(AI268<>\"\",COUNTA($AI$2:$AI268),\"\")","v":""},null,null,null,"",null,"",null,0]
[null,null,null,null,null,null,null,null,null,null,null,null,null,null,null,null,null,null,null,null,null,null,null,null,null,null,null,null,null,null,null,null,null,{"$f":"IF(AI269<>\"\",COUNTA($AI$2:$AI269),\"\")","v":""},null,null,null,"",null,"",null,0]
[null,null,null,null,null,null,null,null,null,null,null,null,null,null,null,null,null,null,null,null,null,null,null,null,null,null,null,null,null,null,null,null,null,{"$f":"IF(AI270<>\"\",COUNTA($AI$2:$AI270),\"\")","v":""},null,null,null,"",null,"",null,0]
[null,null,null,null,null,null,null,null,null,null,null,null,null,null,null,null,null,null,null,null,null,null,null,null,null,null,null,null,null,null,null,null,null,{"$f":"IF(AI271<>\"\",COUNTA($AI$2:$AI271),\"\")","v":""},null,null,null,"",null,"",null,0]
[null,null,null,null,null,null,null,null,null,null,null,null,null,null,null,null,null,null,null,null,null,null,null,null,null,null,null,null,null,null,null,null,null,{"$f":"IF(AI272<>\"\",COUNTA($AI$2:$AI272),\"\")","v":""},null,null,null,"",null,"",null,0]
[null,null,null,null,null,null,null,null,null,null,null,null,null,null,null,null,null,null,null,null,null,null,null,null,null,null,null,null,null,null,null,null,null,{"$f":"IF(AI273<>\"\",COUNTA($AI$2:$AI273),\"\")","v":""},null,null,null,"",null,"",null,0]
[null,null,null,null,null,null,null,null,null,null,null,null,null,null,null,null,null,null,null,null,null,null,null,null,null,null,null,null,null,null,null,null,null,{"$f":"IF(AI274<>\"\",COUNTA($AI$2:$AI274),\"\")","v":""},null,null,null,"",null,"",null,0]
[null,null,null,null,null,null,null,null,null,null,null,null,null,null,null,null,null,null,null,null,null,null,null,null,null,null,null,null,null,null,null,null,null,{"$f":"IF(AI275<>\"\",COUNTA($AI$2:$AI275),\"\")","v":""},null,null,null,"",null,"",null,0]
[null,null,null,null,null,null,null,null,null,null,null,null,null,null,null,null,null,null,null,null,null,null,null,null,null,null,null,null,null,null,null,null,null,{"$f":"IF(AI276<>\"\",COUNTA($AI$2:$AI276),\"\")","v":""},null,null,null,"",null,"",null,0]
[null,null,null,null,null,null,null,null,null,null,null,null,null,null,null,null,null,null,null,null,null,null,null,null,null,null,null,null,null,null,null,null,null,{"$f":"IF(AI277<>\"\",COUNTA($AI$2:$AI277),\"\")","v":""},null,null,null,"",null,"",null,0]
[null,null,null,null,null,null,null,null,null,null,null,null,null,null,null,null,null,null,null,null,null,null,null,null,null,null,null,null,null,null,null,null,null,{"$f":"IF(AI278<>\"\",COUNTA($AI$2:$AI278),\"\")","v":""},null,null,null,"",null,"",null,0]
[null,null,null,null,null,null,null,null,null,null,null,null,null,null,null,null,null,null,null,null,null,null,null,null,null,null,null,null,null,null,null,null,null,{"$f":"IF(AI279<>\"\",COUNTA($AI$2:$AI279),\"\")","v":""},null,null,null,"",null,"",null,0]
[null,null,null,null,null,null,null,null,null,null,null,null,null,null,null,null,null,null,null,null,null,null,null,null,null,null,null,null,null,null,null,null,null,{"$f":"IF(AI280<>\"\",COUNTA($AI$2:$AI280),\"\")","v":""},null,null,null,"",null,"",null,0]
[null,null,null,null,null,null,null,null,null,null,null,null,null,null,null,null,null,null,null,null,null,null,null,null,null,null,null,null,null,null,null,null,null,{"$f":"IF(AI281<>\"\",COUNTA($AI$2:$AI281),\"\")","v":""},null,null,null,"",null,"",null,0]
[null,null,null,null,null,null,null,null,null,null,null,null,null,null,null,null,null,null,null,null,null,null,null,null,null,null,null,null,null,null,null,null,null,{"$f":"IF(AI282<>\"\",COUNTA($AI$2:$AI282),\"\")","v":""},null,null,null,"",null,"",null,0]
[null,null,null,null,null,null,null,null,null,null,null,null,null,null,null,null,null,null,null,null,null,null,null,null,null,null,null,null,null,null,null,null,null,{"$f":"IF(AI283<>\"\",COUNTA($AI$2:$AI283),\"\")","v":""},null,null,null,"",null,"",null,0]
[null,null,null,null,null,null,null,null,null,null,null,null,null,null,null,null,null,null,null,null,null,null,null,null,null,null,null,null,null,null,null,null,null,{"$f":"IF(AI284<>\"\",COUNTA($AI$2:$AI284),\"\")","v":""},null,null,null,"",null,"",null,0]
[null,null,null,null,null,null,null,null,null,null,null,null,null,null,null,null,null,null,null,null,null,null,null,null,null,null,null,null,null,null,null,null,null,{"$f":"IF(AI285<>\"\",COUNTA($AI$2:$AI285),\"\")","v":""},null,null,null,"",null,"",null,0]
[null,null,null,null,null,null,null,null,null,null,null,null,null,null,null,null,null,null,null,null,null,null,null,null,null,null,null,null,null,null,null,null,null,{"$f":"IF(AI286<>\"\",COUNTA($AI$2:$AI286),\"\")","v":""},null,null,null,"",null,"",null,0]
[null,null,null,null,null,null,null,null,null,null,null,null,null,null,null,null,null,null,null,null,null,null,null,null,null,null,null,null,null,null,null,null,null,{"$f":"IF(AI287<>\"\",COUNTA($AI$2:$AI287),\"\")","v":""},null,null,null,"",null,"",null,0]
[null,null,null,null,null,null,null,null,null,null,null,null,null,null,null,null,null,null,null,null,null,null,null,null,null,null,null,null,null,null,null,null,null,{"$f":"IF(AI288<>\"\",COUNTA($AI$2:$AI288),\"\")","v":""},null,null,null,"",null,"",null,0]
[null,null,null,null,null,null,null,null,null,null,null,null,null,null,null,null,null,null,null,null,null,null,null,null,null,null,null,null,null,null,null,null,null,{"$f":"IF(AI289<>\"\",COUNTA($AI$2:$AI289),\"\")","v":""},null,null,null,"",null,"",null,0]
[null,null,null,null,null,null,null,null,null,null,null,null,null,null,null,null,null,null,null,null,null,null,null,null,null,null,null,null,null,null,null,null,null,{"$f":"IF(AI290<>\"\",COUNTA($AI$2:$AI290),\"\")","v":""},null,null,null,"",null,"",null,0]
[null,null,null,null,null,null,null,null,null,null,null,null,null,null,null,null,null,null,null,null,null,null,null,null,null,null,null,null,null,null,null,null,null,{"$f":"IF(AI291<>\"\",COUNTA($AI$2:$AI291),\"\")","v":""},null,null,null,"",null,"",null,0]
[null,null,null,null,null,null,null,null,null,null,null,null,null,null,null,null,null,null,null,null,null,null,null,null,null,null,null,null,null,null,null,null,null,{"$f":"IF(AI292<>\"\",COUNTA($AI$2:$AI292),\"\")","v":""},null,null,null,"",null,"",null,0]
[null,null,null,null,null,null,null,null,null,null,null,null,null,null,null,null,null,null,null,null,null,null,null,null,null,null,null,null,null,null,null,null,null,{"$f":"IF(AI293<>\"\",COUNTA($AI$2:$AI293),\"\")","v":""},null,null,null,"",null,"",null,0]
[null,null,null,null,null,null,null,null,null,null,null,null,null,null,null,null,null,null,null,null,null,null,null,null,null,null,null,null,null,null,null,null,null,{"$f":"IF(AI294<>\"\",COUNTA($AI$2:$AI294),\"\")","v":""},null,null,null,"",null,"",null,0]
[null,null,null,null,null,null,null,null,null,null,null,null,null,null,null,null,null,null,null,null,null,null,null,null,null,null,null,null,null,null,null,null,null,{"$f":"IF(AI295<>\"\",COUNTA($AI$2:$AI295),\"\")","v":""},null,null,null,"",null,"",null,0]
[null,null,null,null,null,null,null,null,null,null,null,null,null,null,null,null,null,null,null,null,null,null,null,null,null,null,null,null,null,null,null,null,null,{"$f":"IF(AI296<>\"\",COUNTA($AI$2:$AI296),\"\")","v":""},null,null,null,"",null,"",null,0]
[null,null,null,null,null,null,null,null,null,null,null,null,null,null,null,null,null,null,null,null,null,null,null,null,null,null,null,null,null,null,null,null,null,{"$f":"IF(AI297<>\"\",COUNTA($AI$2:$AI297),\"\")","v":""},null,null,null,"",null,"",null,0]
[null,null,null,null,null,null,null,null,null,null,null,null,null,null,null,null,null,null,null,null,null,null,null,null,null,null,null,null,null,null,null,null,null,{"$f":"IF(AI298<>\"\",COUNTA($AI$2:$AI298),\"\")","v":""},null,null,null,"",null,"",null,0]
[null,null,null,null,null,null,null,null,null,null,null,null,null,null,null,null,null,null,null,null,null,null,null,null,null,null,null,null,null,null,null,null,null,{"$f":"IF(AI299<>\"\",COUNTA($AI$2:$AI299),\"\")","v":""},null,null,null,"",null,"",null,0]
[null,null,null,null,null,null,null,null,null,null,null,null,null,null,null,null,null,null,null,null,null,null,null,null,null,null,null,null,null,null,null,null,null,{"$f":"IF(AI300<>\"\",COUNTA($AI$2:$AI300),\"\")","v":""},null,null,null,"",null,"",null,0]
[null,null,null,null,null,null,null,null,null,null,null,null,null,null,null,null,null,null,null,null,null,null,null,null,null,null,null,null,null,null,null,null,null,{"$f":"IF(AI301<>\"\",COUNTA($AI$2:$AI301),\"\")","v":""},null,null,null,"",null,"",null,0]
[null,null,null,null,null,null,null,null,null,null,null,null,null,null,null,null,null,null,null,null,null,null,null,null,null,null,null,null,null,null,null,null,null,{"$f":"IF(AI302<>\"\",COUNTA($AI$2:$AI302),\"\")","v":""},null,null,null,"",null,"",null,0]
[null,null,null,null,null,null,null,null,null,null,null,null,null,null,null,null,null,null,null,null,null,null,null,null,null,null,null,null,null,null,null,null,null,{"$f":"IF(AI303<>\"\",COUNTA($AI$2:$AI303),\"\")","v":""},null,null,null,"",null,"",null,0]
[null,null,null,null,null,null,null,null,null,null,null,null,null,null,null,null,null,null,null,null,null,null,null,null,null,null,null,null,null,null,null,null,null,{"$f":"IF(AI304<>\"\",COUNTA($AI$2:$AI304),\"\")","v":""},null,null,null,"",null,"",null,0]
[null,null,null,null,null,null,null,null,null,null,null,null,null,null,null,null,null,null,null,null,null,null,null,null,null,null,null,null,null,null,null,null,null,{"$f":"IF(AI305<>\"\",COUNTA($AI$2:$AI305),\"\")","v":""},null,null,null,"",null,"",null,0]
[null,null,null,null,null,null,null,null,null,null,null,null,null,null,null,null,null,null,null,null,null,null,null,null,null,null,null,null,null,null,null,null,null,{"$f":"IF(AI306<>\"\",COUNTA($AI$2:$AI306),\"\")","v":""},null,null,null,"",null,"",null,0]
[null,null,null,null,null,null,null,null,null,null,null,null,null,null,null,null,null,null,null,null,null,null,null,null,null,null,null,null,null,null,null,null,null,{"$f":"IF(AI307<>\"\",COUNTA($AI$2:$AI307),\"\")","v":""},null,null,null,"",null,"",null,0]
[null,null,null,null,null,null,null,null,null,null,null,null,null,null,null,null,null,null,null,null,null,null,null,null,null,null,null,null,null,null,null,null,null,{"$f":"IF(AI308<>\"\",COUNTA($AI$2:$AI308),\"\")","v":""},null,null,null,"",null,"",null,0]
[null,null,null,null,null,null,null,null,null,null,null,null,null,null,null,null,null,null,null,null,null,null,null,null,null,null,null,null,null,null,null,null,null,{"$f":"IF(AI309<>\"\",COUNTA($AI$2:$AI309),\"\")","v":""},null,null,null,"",null,"",null,0]
[null,null,null,null,null,null,null,null,null,null,null,null,null,null,null,null,null,null,null,null,null,null,null,null,null,null,null,null,null,null,null,null,null,{"$f":"IF(AI310<>\"\",COUNTA($AI$2:$AI310),\"\")","v":""},null,null,null,"",null,"",null,0]
[null,null,null,null,null,null,null,null,null,null,null,null,null,null,null,null,null,null,null,null,null,null,null,null,null,null,null,null,null,null,null,null,null,{"$f":"IF(AI311<>\"\",COUNTA($AI$2:$AI311),\"\")","v":""},null,null,null,"",null,"",null,0]
[null,null,null,null,null,null,null,null,null,null,null,null,null,null,null,null,null,null,null,null,null,null,null,null,null,null,null,null,null,null,null,null,null,{"$f":"IF(AI312<>\"\",COUNTA($AI$2:$AI312),\"\")","v":""},null,null,null,"",null,"",null,0]
[null,null,null,null,null,null,null,null,null,null,null,null,null,null,null,null,null,null,null,null,null,null,null,null,null,null,null,null,null,null,null,null,null,{"$f":"IF(AI313<>\"\",COUNTA($AI$2:$AI313),\"\")","v":""},null,null,null,"",null,"",null,0]
[null,null,null,null,null,null,null,null,null,null,null,null,null,null,null,null,null,null,null,null,null,null,null,null,null,null,null,null,null,null,null,null,null,{"$f":"IF(AI314<>\"\",COUNTA($AI$2:$AI314),\"\")","v":""},null,null,null,"",null,"",null,0]
[null,null,null,null,null,null,null,null,null,null,null,null,null,null,null,null,null,null,null,null,null,null,null,null,null,null,null,null,null,null,null,null,null,{"$f":"IF(AI315<>\"\",COUNTA($AI$2:$AI315),\"\")","v":""},null,null,null,"",null,"",null,0]
[null,null,null,null,null,null,null,null,null,null,null,null,null,null,null,null,null,null,null,null,null,null,null,null,null,null,null,null,null,null,null,null,null,{"$f":"IF(AI316<>\"\",COUNTA($AI$2:$AI316),\"\")","v":""},null,null,null,"",null,"",null,0]
[null,null,null,null,null,null,null,null,null,null,null,null,null,null,null,null,null,null,null,null,null,null,null,null,null,null,null,null,null,null,null,null,null,{"$f":"IF(AI317<>\"\",COUNTA($AI$2:$AI317),\"\")","v":""},null,null,null,"",null,"",null,0]
[null,null,null,null,null,null,null,null,null,null,null,null,null,null,null,null,null,null,null,null,null,null,null,null,null,null,null,null,null,null,null,null,null,{"$f":"IF(AI318<>\"\",COUNTA($AI$2:$AI318),\"\")","v":""},null,null,null,"",null,"",null,0]
[null,null,null,null,null,null,null,null,null,null,null,null,null,null,null,null,null,null,null,null,null,null,null,null,null,null,null,null,null,null,null,null,null,{"$f":"IF(AI319<>\"\",COUNTA($AI$2:$AI319),\"\")","v":""},null,null,null,"",null,"",null,0]
[null,null,null,null,null,null,null,null,null,null,null,null,null,null,null,null,null,null,null,null,null,null,null,null,null,null,null,null,null,null,null,null,null,{"$f":"IF(AI320<>\"\",COUNTA($AI$2:$AI320),\"\")","v":""},null,null,null,"",null,"",null,0]
[null,null,null,null,null,null,null,null,null,null,null,null,null,null,null,null,null,null,null,null,null,null,null,null,null,null,null,null,null,null,null,null,null,{"$f":"IF(AI321<>\"\",COUNTA($AI$2:$AI321),\"\")","v":""},null,null,null,"",null,"",null,0]
[null,null,null,null,null,null,null,null,null,null,null,null,null,null,null,null,null,null,null,null,null,null,null,null,null,null,null,null,null,null,null,null,null,{"$f":"IF(AI322<>\"\",COUNTA($AI$2:$AI322),\"\")","v":""},null,null,null,{"$f":"IFERROR(IF(AI322=\"\",\"\",IF(AJ322=\"gesetzt\",RAND()*5000000,RAND()*1000*20)),\"\")","v":""},null,"",null,0]
[null,null,null,null,null,null,null,null,null,null,null,null,null,null,null,null,null,null,null,null,null,null,null,null,null,null,null,null,null,null,null,null,null,{"$f":"IF(AI323<>\"\",COUNTA($AI$2:$AI323),\"\")","v":""},null,null,null,"",null,{"$f":"IF(AJ323=\"\",\"\",AJ323)","v":""},null,{"$f":"IF(AN323=\"gesetzt\",1,0)","v":0}]
[null,null,null,null,null,null,null,null,null,null,null,null,null,null,null,null,null,null,null,null,null,null,null,null,null,null,null,null,null,null,null,null,null,{"$f":"IF(AI324<>\"\",COUNTA($AI$2:$AI324),\"\")","v":""},null,null,null,"",null,"",null,0]
[null,null,null,null,null,null,null,null,null,null,null,null,null,null,null,null,null,null,null,null,null,null,null,null,null,null,null,null,null,null,null,null,null,{"$f":"IF(AI325<>\"\",COUNTA($AI$2:$AI325),\"\")","v":""},null,null,null,"",null,"",null,0]
[null,null,null,null,null,null,null,null,null,null,null,null,null,null,null,null,null,null,null,null,null,null,null,null,null,null,null,null,null,null,null,null,null,{"$f":"IF(AI326<>\"\",COUNTA($AI$2:$AI326),\"\")","v":""},null,null,null,"",null,"",null,0]
[null,null,null,null,null,null,null,null,null,null,null,null,null,null,null,null,null,null,null,null,null,null,null,null,null,null,null,null,null,null,null,null,null,{"$f":"IF(AI327<>\"\",COUNTA($AI$2:$AI327),\"\")","v":""},null,null,null,"",null,"",null,0]
[null,null,null,null,null,null,null,null,null,null,null,null,null,null,null,null,null,null,null,null,null,null,null,null,null,null,null,null,null,null,null,null,null,{"$f":"IF(AI328<>\"\",COUNTA($AI$2:$AI328),\"\")","v":""},null,null,null,"",null,"",null,0]
[null,null,null,null,null,null,null,null,null,null,null,null,null,null,null,null,null,null,null,null,null,null,null,null,null,null,null,null,null,null,null,null,null,{"$f":"IF(AI329<>\"\",COUNTA($AI$2:$AI329),\"\")","v":""},null,null,null,"",null,"",null,0]
[null,null,null,null,null,null,null,null,null,null,null,null,null,null,null,null,null,null,null,null,null,null,null,null,null,null,null,null,null,null,null,null,null,{"$f":"IF(AI330<>\"\",COUNTA($AI$2:$AI330),\"\")","v":""},null,null,null,"",null,"",null,0]
[null,null,null,null,null,null,null,null,null,null,null,null,null,null,null,null,null,null,null,null,null,null,null,null,null,null,null,null,null,null,null,null,null,{"$f":"IF(AI331<>\"\",COUNTA($AI$2:$AI331),\"\")","v":""},null,null,null,"",null,"",null,0]
[null,null,null,null,null,null,null,null,null,null,null,null,null,null,null,null,null,null,null,null,null,null,null,null,null,null,null,null,null,null,null,null,null,{"$f":"IF(AI332<>\"\",COUNTA($AI$2:$AI332),\"\")","v":""},null,null,null,"",null,"",null,0]
[null,null,null,null,null,null,null,null,null,null,null,null,null,null,null,null,null,null,null,null,null,null,null,null,null,null,null,null,null,null,null,null,null,{"$f":"IF(AI333<>\"\",COUNTA($AI$2:$AI333),\"\")","v":""},null,null,null,"",null,"",null,0]
[null,null,null,null,null,null,null,null,null,null,null,null,null,null,null,null,null,null,null,null,null,null,null,null,null,null,null,null,null,null,null,null,null,{"$f":"IF(AI334<>\"\",COUNTA($AI$2:$AI334),\"\")","v":""},null,null,null,"",null,"",null,0]
[null,null,null,null,null,null,null,null,null,null,null,null,null,null,null,null,null,null,null,null,null,null,null,null,null,null,null,null,null,null,null,null,null,{"$f":"IF(AI335<>\"\",COUNTA($AI$2:$AI335),\"\")","v":""},null,null,null,"",null,"",null,0]
[null,null,null,null,null,null,null,null,null,null,null,null,null,null,null,null,null,null,null,null,null,null,null,null,null,null,null,null,null,null,null,null,null,{"$f":"IF(AI336<>\"\",COUNTA($AI$2:$AI336),\"\")","v":""},null,null,null,"",null,"",null,0]
[null,null,null,null,null,null,null,null,null,null,null,null,null,null,null,null,null,null,null,null,null,null,null,null,null,null,null,null,null,null,null,null,null,{"$f":"IF(AI337<>\"\",COUNTA($AI$2:$AI337),\"\")","v":""},null,null,null,"",null,"",null,0]
[null,null,null,null,null,null,null,null,null,null,null,null,null,null,null,null,null,null,null,null,null,null,null,null,null,null,null,null,null,null,null,null,null,{"$f":"IF(AI338<>\"\",COUNTA($AI$2:$AI338),\"\")","v":""},null,null,null,"",null,"",null,0]
[null,null,null,null,null,null,null,null,null,null,null,null,null,null,null,null,null,null,null,null,null,null,null,null,null,null,null,null,null,null,null,null,null,{"$f":"IF(AI339<>\"\",COUNTA($AI$2:$AI339),\"\")","v":""},null,null,null,"",null,"",null,0]
[null,null,null,null,null,null,null,null,null,null,null,null,null,null,null,null,null,null,null,null,null,null,null,null,null,null,null,null,null,null,null,null,null,{"$f":"IF(AI340<>\"\",COUNTA($AI$2:$AI340),\"\")","v":""},null,null,null,"",null,"",null,0]
[null,null,null,null,null,null,null,null,null,null,null,null,null,null,null,null,null,null,null,null,null,null,null,null,null,null,null,null,null,null,null,null,null,{"$f":"IF(AI341<>\"\",COUNTA($AI$2:$AI341),\"\")","v":""},null,null,null,"",null,"",null,0]
[null,null,null,null,null,null,null,null,null,null,null,null,null,null,null,null,null,null,null,null,null,null,null,null,null,null,null,null,null,null,null,null,null,{"$f":"IF(AI342<>\"\",COUNTA($AI$2:$AI342),\"\")","v":""},null,null,null,"",null,"",null,0]
[null,null,null,null,null,null,null,null,null,null,null,null,null,null,null,null,null,null,null,null,null,null,null,null,null,null,null,null,null,null,null,null,null,{"$f":"IF(AI343<>\"\",COUNTA($AI$2:$AI343),\"\")","v":""},null,null,null,"",null,"",null,0]
[null,null,null,null,null,null,null,null,null,null,null,null,null,null,null,null,null,null,null,null,null,null,null,null,null,null,null,null,null,null,null,null,null,{"$f":"IF(AI344<>\"\",COUNTA($AI$2:$AI344),\"\")","v":""},null,null,null,"",null,"",null,0]
[null,null,null,null,null,null,null,null,null,null,null,null,null,null,null,null,null,null,null,null,null,null,null,null,null,null,null,null,null,null,null,null,null,{"$f":"IF(AI345<>\"\",COUNTA($AI$2:$AI345),\"\")","v":""},null,null,null,"",null,"",null,0]
[null,null,null,null,null,null,null,null,null,null,null,null,null,null,null,null,null,null,null,null,null,null,null,null,null,null,null,null,null,null,null,null,null,{"$f":"IF(AI346<>\"\",COUNTA($AI$2:$AI346),\"\")","v":""},null,null,null,"",null,"",null,0]
[null,null,null,null,null,null,null,null,null,null,null,null,null,null,null,null,null,null,null,null,null,null,null,null,null,null,null,null,null,null,null,null,null,{"$f":"IF(AI347<>\"\",COUNTA($AI$2:$AI347),\"\")","v":""},null,null,null,"",null,"",null,0]
[null,null,null,null,null,null,null,null,null,null,null,null,null,null,null,null,null,null,null,null,null,null,null,null,null,null,null,null,null,null,null,null,null,{"$f":"IF(AI348<>\"\",COUNTA($AI$2:$AI348),\"\")","v":""},null,null,null,"",null,"",null,0]
[null,null,null,null,null,null,null,null,null,null,null,null,null,null,null,null,null,null,null,null,null,null,null,null,null,null,null,null,null,null,null,null,null,{"$f":"IF(AI349<>\"\",COUNTA($AI$2:$AI349),\"\")","v":""},null,null,null,"",null,"",null,0]
[null,null,null,null,null,null,null,null,null,null,null,null,null,null,null,null,null,null,null,null,null,null,null,null,null,null,null,null,null,null,null,null,null,{"$f":"IF(AI350<>\"\",COUNTA($AI$2:$AI350),\"\")","v":""},null,null,null,"",null,"",null,0]
[null,null,null,null,null,null,null,null,null,null,null,null,null,null,null,null,null,null,null,null,null,null,null,null,null,null,null,null,null,null,null,null,null,{"$f":"IF(AI351<>\"\",COUNTA($AI$2:$AI351),\"\")","v":""},null,null,null,"",null,"",null,0]
[null,null,null,null,null,null,null,null,null,null,null,null,null,null,null,null,null,null,null,null,null,null,null,null,null,null,null,null,null,null,null,null,null,{"$f":"IF(AI352<>\"\",COUNTA($AI$2:$AI352),\"\")","v":""},null,null,null,"",null,"",null,0]
[null,null,null,null,null,null,null,null,null,null,null,null,null,null,null,null,null,null,null,null,null,null,null,null,null,null,null,null,null,null,null,null,null,{"$f":"IF(AI353<>\"\",COUNTA($AI$2:$AI353),\"\")","v":""},null,null,null,"",null,"",null,0]
[null,null,null,null,null,null,null,null,null,null,null,null,null,null,null,null,null,null,null,null,null,null,null,null,null,null,null,null,null,null,null,null,null,{"$f":"IF(AI354<>\"\",COUNTA($AI$2:$AI354),\"\")","v":""},null,null,null,"",null,"",null,0]
[null,null,null,null,null,null,null,null,null,null,null,null,null,null,null,null,null,null,null,null,null,null,null,null,null,null,null,null,null,null,null,null,null,{"$f":"IF(AI355<>\"\",COUNTA($AI$2:$AI355),\"\")","v":""},null,null,null,"",null,"",null,0]
[null,null,null,null,null,null,null,null,null,null,null,null,null,null,null,null,null,null,null,null,null,null,null,null,null,null,null,null,null,null,null,null,null,{"$f":"IF(AI356<>\"\",COUNTA($AI$2:$AI356),\"\")","v":""},null,null,null,"",null,"",null,0]
[null,null,null,null,null,null,null,null,null,null,null,null,null,null,null,null,null,null,null,null,null,null,null,null,null,null,null,null,null,null,null,null,null,{"$f":"IF(AI357<>\"\",COUNTA($AI$2:$AI357),\"\")","v":""},null,null,null,"",null,"",null,0]
[null,null,null,null,null,null,null,null,null,null,null,null,null,null,null,null,null,null,null,null,null,null,null,null,null,null,null,null,null,null,null,null,null,{"$f":"IF(AI358<>\"\",COUNTA($AI$2:$AI358),\"\")","v":""},null,null,null,"",null,"",null,0]
[null,null,null,null,null,null,null,null,null,null,null,null,null,null,null,null,null,null,null,null,null,null,null,null,null,null,null,null,null,null,null,null,null,{"$f":"IF(AI359<>\"\",COUNTA($AI$2:$AI359),\"\")","v":""},null,null,null,"",null,"",null,0]
[null,null,null,null,null,null,null,null,null,null,null,null,null,null,null,null,null,null,null,null,null,null,null,null,null,null,null,null,null,null,null,null,null,{"$f":"IF(AI360<>\"\",COUNTA($AI$2:$AI360),\"\")","v":""},null,null,null,"",null,"",null,0]
[null,null,null,null,null,null,null,null,null,null,null,null,null,null,null,null,null,null,null,null,null,null,null,null,null,null,null,null,null,null,null,null,null,{"$f":"IF(AI361<>\"\",COUNTA($AI$2:$AI361),\"\")","v":""},null,null,null,"",null,"",null,0]
[null,null,null,null,null,null,null,null,null,null,null,null,null,null,null,null,null,null,null,null,null,null,null,null,null,null,null,null,null,null,null,null,null,{"$f":"IF(AI362<>\"\",COUNTA($AI$2:$AI362),\"\")","v":""},null,null,null,"",null,"",null,0]
[null,null,null,null,null,null,null,null,null,null,null,null,null,null,null,null,null,null,null,null,null,null,null,null,null,null,null,null,null,null,null,null,null,{"$f":"IF(AI363<>\"\",COUNTA($AI$2:$AI363),\"\")","v":""},null,null,null,"",null,"",null,0]
[null,null,null,null,null,null,null,null,null,null,null,null,null,null,null,null,null,null,null,null,null,null,null,null,null,null,null,null,null,null,null,null,null,{"$f":"IF(AI364<>\"\",COUNTA($AI$2:$AI364),\"\")","v":""},null,null,null,"",null,"",null,0]
[null,null,null,null,null,null,null,null,null,null,null,null,null,null,null,null,null,null,null,null,null,null,null,null,null,null,null,null,null,null,null,null,null,{"$f":"IF(AI365<>\"\",COUNTA($AI$2:$AI365),\"\")","v":""},null,null,null,"",null,"",null,0]
[null,null,null,null,null,null,null,null,null,null,null,null,null,null,null,null,null,null,null,null,null,null,null,null,null,null,null,null,null,null,null,null,null,{"$f":"IF(AI366<>\"\",COUNTA($AI$2:$AI366),\"\")","v":""},null,null,null,"",null,"",null,0]
[null,null,null,null,null,null,null,null,null,null,null,null,null,null,null,null,null,null,null,null,null,null,null,null,null,null,null,null,null,null,null,null,null,{"$f":"IF(AI367<>\"\",COUNTA($AI$2:$AI367),\"\")","v":""},null,null,null,"",null,"",null,0]
[null,null,null,null,null,null,null,null,null,null,null,null,null,null,null,null,null,null,null,null,null,null,null,null,null,null,null,null,null,null,null,null,null,{"$f":"IF(AI368<>\"\",COUNTA($AI$2:$AI368),\"\")","v":""},null,null,null,"",null,"",null,0]
[null,null,null,null,null,null,null,null,null,null,null,null,null,null,null,null,null,null,null,null,null,null,null,null,null,null,null,null,null,null,null,null,null,{"$f":"IF(AI369<>\"\",COUNTA($AI$2:$AI369),\"\")","v":""},null,null,null,"",null,"",null,0]
[null,null,null,null,null,null,null,null,null,null,null,null,null,null,null,null,null,null,null,null,null,null,null,null,null,null,null,null,null,null,null,null,null,{"$f":"IF(AI370<>\"\",COUNTA($AI$2:$AI370),\"\")","v":""},null,null,null,"",null,"",null,0]
[null,null,null,null,null,null,null,null,null,null,null,null,null,null,null,null,null,null,null,null,null,null,null,null,null,null,null,null,null,null,null,null,null,{"$f":"IF(AI371<>\"\",COUNTA($AI$2:$AI371),\"\")","v":""},null,null,null,"",null,"",null,0]
[null,null,null,null,null,null,null,null,null,null,null,null,null,null,null,null,null,null,null,null,null,null,null,null,null,null,null,null,null,null,null,null,null,{"$f":"IF(AI372<>\"\",COUNTA($AI$2:$AI372),\"\")","v":""},null,null,null,"",null,"",null,0]
[null,null,null,null,null,null,null,null,null,null,null,null,null,null,null,null,null,null,null,null,null,null,null,null,null,null,null,null,null,null,null,null,null,{"$f":"IF(AI373<>\"\",COUNTA($AI$2:$AI373),\"\")","v":""},null,null,null,"",null,"",null,0]
[null,null,null,null,null,null,null,null,null,null,null,null,null,null,null,null,null,null,null,null,null,null,null,null,null,null,null,null,null,null,null,null,null,{"$f":"IF(AI374<>\"\",COUNTA($AI$2:$AI374),\"\")","v":""},null,null,null,"",null,"",null,0]
[null,null,null,null,null,null,null,null,null,null,null,null,null,null,null,null,null,null,null,null,null,null,null,null,null,null,null,null,null,null,null,null,null,{"$f":"IF(AI375<>\"\",COUNTA($AI$2:$AI375),\"\")","v":""},null,null,null,"",null,"",null,0]
[null,null,null,null,null,null,null,null,null,null,null,null,null,null,null,null,null,null,null,null,null,null,null,null,null,null,null,null,null,null,null,null,null,{"$f":"IF(AI376<>\"\",COUNTA($AI$2:$AI376),\"\")","v":""},null,null,null,"",null,"",null,0]
[null,null,null,null,null,null,null,null,null,null,null,null,null,null,null,null,null,null,null,null,null,null,null,null,null,null,null,null,null,null,null,null,null,{"$f":"IF(AI377<>\"\",COUNTA($AI$2:$AI377),\"\")","v":""},null,null,null,"",null,"",null,0]
[null,null,null,null,null,null,null,null,null,null,null,null,null,null,null,null,null,null,null,null,null,null,null,null,null,null,null,null,null,null,null,null,null,{"$f":"IF(AI378<>\"\",COUNTA($AI$2:$AI378),\"\")","v":""},null,null,null,"",null,"",null,0]
[null,null,null,null,null,null,null,null,null,null,null,null,null,null,null,null,null,null,null,null,null,null,null,null,null,null,null,null,null,null,null,null,null,{"$f":"IF(AI379<>\"\",COUNTA($AI$2:$AI379),\"\")","v":""},null,null,null,"",null,"",null,0]
[null,null,null,null,null,null,null,null,null,null,null,null,null,null,null,null,null,null,null,null,null,null,null,null,null,null,null,null,null,null,null,null,null,{"$f":"IF(AI380<>\"\",COUNTA($AI$2:$AI380),\"\")","v":""},null,null,null,"",null,"",null,0]
[null,null,null,null,null,null,null,null,null,null,null,null,null,null,null,null,null,null,null,null,null,null,null,null,null,null,null,null,null,null,null,null,null,{"$f":"IF(AI381<>\"\",COUNTA($AI$2:$AI381),\"\")","v":""},null,null,null,"",null,"",null,0]
[null,null,null,null,null,null,null,null,null,null,null,null,null,null,null,null,null,null,null,null,null,null,null,null,null,null,null,null,null,null,null,null,null,{"$f":"IF(AI382<>\"\",COUNTA($AI$2:$AI382),\"\")","v":""},null,null,null,"",null,"",null,0]
[null,null,null,null,null,null,null,null,null,null,null,null,null,null,null,null,null,null,null,null,null,null,null,null,null,null,null,null,null,null,null,null,null,{"$f":"IF(AI383<>\"\",COUNTA($AI$2:$AI383),\"\")","v":""},null,null,null,"",null,"",null,0]
[null,null,null,null,null,null,null,null,null,null,null,null,null,null,null,null,null,null,null,null,null,null,null,null,null,null,null,null,null,null,null,null,null,{"$f":"IF(AI384<>\"\",COUNTA($AI$2:$AI384),\"\")","v":""},null,null,null,"",null,"",null,0]
[null,null,null,null,null,null,null,null,null,null,null,null,null,null,null,null,null,null,null,null,null,null,null,null,null,null,null,null,null,null,null,null,null,{"$f":"IF(AI385<>\"\",COUNTA($AI$2:$AI385),\"\")","v":""},null,null,null,"",null,"",null,0]
[null,null,null,null,null,null,null,null,null,null,null,null,null,null,null,null,null,null,null,null,null,null,null,null,null,null,null,null,null,null,null,null,null,{"$f":"IF(AI386<>\"\",COUNTA($AI$2:$AI386),\"\")","v":""},null,null,null,{"$f":"IFERROR(IF(AI386=\"\",\"\",IF(AJ386=\"gesetzt\",RAND()*5000000,RAND()*1000*20)),\"\")","v":""},null,"",null,0]
[null,null,null,null,null,null,null,null,null,null,null,null,null,null,null,null,null,null,null,null,null,null,null,null,null,null,null,null,null,null,null,null,null,{"$f":"IF(AI387<>\"\",COUNTA($AI$2:$AI387),\"\")","v":""},null,null,null,"",null,{"$f":"IF(AJ387=\"\",\"\",AJ387)","v":""},null,{"$f":"IF(AN387=\"gesetzt\",1,0)","v":0}]
[null,null,null,null,null,null,null,null,null,null,null,null,null,null,null,null,null,null,null,null,null,null,null,null,null,null,null,null,null,null,null,null,null,{"$f":"IF(AI388<>\"\",COUNTA($AI$2:$AI388),\"\")","v":""},null,null,null,"",null,"",null,0]
[null,null,null,null,null,null,null,null,null,null,null,null,null,null,null,null,null,null,null,null,null,null,null,null,null,null,null,null,null,null,null,null,null,{"$f":"IF(AI389<>\"\",COUNTA($AI$2:$AI389),\"\")","v":""},null,null,null,"",null,"",null,0]
[null,null,null,null,null,null,null,null,null,null,null,null,null,null,null,null,null,null,null,null,null,null,null,null,null,null,null,null,null,null,null,null,null,{"$f":"IF(AI390<>\"\",COUNTA($AI$2:$AI390),\"\")","v":""},null,null,null,"",null,"",null,0]
[null,null,null,null,null,null,null,null,null,null,null,null,null,null,null,null,null,null,null,null,null,null,null,null,null,null,null,null,null,null,null,null,null,{"$f":"IF(AI391<>\"\",COUNTA($AI$2:$AI391),\"\")","v":""},null,null,null,"",null,"",null,0]
[null,null,null,null,null,null,null,null,null,null,null,null,null,null,null,null,null,null,null,null,null,null,null,null,null,null,null,null,null,null,null,null,null,{"$f":"IF(AI392<>\"\",COUNTA($AI$2:$AI392),\"\")","v":""},null,null,null,"",null,"",null,0]
[null,null,null,null,null,null,null,null,null,null,null,null,null,null,null,null,null,null,null,null,null,null,null,null,null,null,null,null,null,null,null,null,null,{"$f":"IF(AI393<>\"\",COUNTA($AI$2:$AI393),\"\")","v":""},null,null,null,"",null,"",null,0]
[null,null,null,null,null,null,null,null,null,null,null,null,null,null,null,null,null,null,null,null,null,null,null,null,null,null,null,null,null,null,null,null,null,{"$f":"IF(AI394<>\"\",COUNTA($AI$2:$AI394),\"\")","v":""},null,null,null,"",null,"",null,0]
[null,null,null,null,null,null,null,null,null,null,null,null,null,null,null,null,null,null,null,null,null,null,null,null,null,null,null,null,null,null,null,null,null,{"$f":"IF(AI395<>\"\",COUNTA($AI$2:$AI395),\"\")","v":""},null,null,null,"",null,"",null,0]
[null,null,null,null,null,null,null,null,null,null,null,null,null,null,null,null,null,null,null,null,null,null,null,null,null,null,null,null,null,null,null,null,null,{"$f":"IF(AI396<>\"\",COUNTA($AI$2:$AI396),\"\")","v":""},null,null,null,"",null,"",null,0]
[null,null,null,null,null,null,null,null,null,null,null,null,null,null,null,null,null,null,null,null,null,null,null,null,null,null,null,null,null,null,null,null,null,{"$f":"IF(AI397<>\"\",COUNTA($AI$2:$AI397),\"\")","v":""},null,null,null,"",null,"",null,0]
[null,null,null,null,null,null,null,null,null,null,null,null,null,null,null,null,null,null,null,null,null,null,null,null,null,null,null,null,null,null,null,null,null,{"$f":"IF(AI398<>\"\",COUNTA($AI$2:$AI398),\"\")","v":""},null,null,null,"",null,"",null,0]
[null,null,null,null,null,null,null,null,null,null,null,null,null,null,null,null,null,null,null,null,null,null,null,null,null,null,null,null,null,null,null,null,null,{"$f":"IF(AI399<>\"\",COUNTA($AI$2:$AI399),\"\")","v":""},null,null,null,"",null,"",null,0]
[null,null,null,null,null,null,null,null,null,null,null,null,null,null,null,null,null,null,null,null,null,null,null,null,null,null,null,null,null,null,null,null,null,{"$f":"IF(AI400<>\"\",COUNTA($AI$2:$AI400),\"\")","v":""},null,null,null,"",null,"",null,0]
[null,null,null,null,null,null,null,null,null,null,null,null,null,null,null,null,null,null,null,null,null,null,null,null,null,null,null,null,null,null,null,null,null,{"$f":"IF(AI401<>\"\",COUNTA($AI$2:$AI401),\"\")","v":""},null,null,null,"",null,"",null,0]
[null,null,null,null,null,null,null,null,null,null,null,null,null,null,null,null,null,null,null,null,null,null,null,null,null,null,null,null,null,null,null,null,null,{"$f":"IF(AI402<>\"\",COUNTA($AI$2:$AI402),\"\")","v":""},null,null,null,"",null,"",null,0]
[null,null,null,null,null,null,null,null,null,null,null,null,null,null,null,null,null,null,null,null,null,null,null,null,null,null,null,null,null,null,null,null,null,{"$f":"IF(AI403<>\"\",COUNTA($AI$2:$AI403),\"\")","v":""},null,null,null,"",null,"",null,0]
[null,null,null,null,null,null,null,null,null,null,null,null,null,null,null,null,null,null,null,null,null,null,null,null,null,null,null,null,null,null,null,null,null,{"$f":"IF(AI404<>\"\",COUNTA($AI$2:$AI404),\"\")","v":""},null,null,null,"",null,"",null,0]
[null,null,null,null,null,null,null,null,null,null,null,null,null,null,null,null,null,null,null,null,null,null,null,null,null,null,null,null,null,null,null,null,null,{"$f":"IF(AI405<>\"\",COUNTA($AI$2:$AI405),\"\")","v":""},null,null,null,"",null,"",null,0]
[null,null,null,null,null,null,null,null,null,null,null,null,null,null,null,null,null,null,null,null,null,null,null,null,null,null,null,null,null,null,null,null,null,{"$f":"IF(AI406<>\"\",COUNTA($AI$2:$AI406),\"\")","v":""},null,null,null,"",null,"",null,0]
[null,null,null,null,null,null,null,null,null,null,null,null,null,null,null,null,null,null,null,null,null,null,null,null,null,null,null,null,null,null,null,null,null,{"$f":"IF(AI407<>\"\",COUNTA($AI$2:$AI407),\"\")","v":""},null,null,null,"",null,"",null,0]
[null,null,null,null,null,null,null,null,null,null,null,null,null,null,null,null,null,null,null,null,null,null,null,null,null,null,null,null,null,null,null,null,null,{"$f":"IF(AI408<>\"\",COUNTA($AI$2:$AI408),\"\")","v":""},null,null,null,"",null,"",null,0]
[null,null,null,null,null,null,null,null,null,null,null,null,null,null,null,null,null,null,null,null,null,null,null,null,null,null,null,null,null,null,null,null,null,{"$f":"IF(AI409<>\"\",COUNTA($AI$2:$AI409),\"\")","v":""},null,null,null,"",null,"",null,0]
[null,null,null,null,null,null,null,null,null,null,null,null,null,null,null,null,null,null,null,null,null,null,null,null,null,null,null,null,null,null,null,null,null,{"$f":"IF(AI410<>\"\",COUNTA($AI$2:$AI410),\"\")","v":""},null,null,null,"",null,"",null,0]
[null,null,null,null,null,null,null,null,null,null,null,null,null,null,null,null,null,null,null,null,null,null,null,null,null,null,null,null,null,null,null,null,null,{"$f":"IF(AI411<>\"\",COUNTA($AI$2:$AI411),\"\")","v":""},null,null,null,"",null,"",null,0]
[null,null,null,null,null,null,null,null,null,null,null,null,null,null,null,null,null,null,null,null,null,null,null,null,null,null,null,null,null,null,null,null,null,{"$f":"IF(AI412<>\"\",COUNTA($AI$2:$AI412),\"\")","v":""},null,null,null,"",null,"",null,0]
[null,null,null,null,null,null,null,null,null,null,null,null,null,null,null,null,null,null,null,null,null,null,null,null,null,null,null,null,null,null,null,null,null,{"$f":"IF(AI413<>\"\",COUNTA($AI$2:$AI413),\"\")","v":""},null,null,null,"",null,"",null,0]
[null,null,null,null,null,null,null,null,null,null,null,null,null,null,null,null,null,null,null,null,null,null,null,null,null,null,null,null,null,null,null,null,null,{"$f":"IF(AI414<>\"\",COUNTA($AI$2:$AI414),\"\")","v":""},null,null,null,"",null,"",null,0]
[null,null,null,null,null,null,null,null,null,null,null,null,null,null,null,null,null,null,null,null,null,null,null,null,null,null,null,null,null,null,null,null,null,{"$f":"IF(AI415<>\"\",COUNTA($AI$2:$AI415),\"\")","v":""},null,null,null,"",null,"",null,0]
[null,null,null,null,null,null,null,null,null,null,null,null,null,null,null,null,null,null,null,null,null,null,null,null,null,null,null,null,null,null,null,null,null,{"$f":"IF(AI416<>\"\",COUNTA($AI$2:$AI416),\"\")","v":""},null,null,null,"",null,"",null,0]
[null,null,null,null,null,null,null,null,null,null,null,null,null,null,null,null,null,null,null,null,null,null,null,null,null,null,null,null,null,null,null,null,null,{"$f":"IF(AI417<>\"\",COUNTA($AI$2:$AI417),\"\")","v":""},null,null,null,"",null,"",null,0]
[null,null,null,null,null,null,null,null,null,null,null,null,null,null,null,null,null,null,null,null,null,null,null,null,null,null,null,null,null,null,null,null,null,{"$f":"IF(AI418<>\"\",COUNTA($AI$2:$AI418),\"\")","v":""},null,null,null,"",null,"",null,0]
[null,null,null,null,null,null,null,null,null,null,null,null,null,null,null,null,null,null,null,null,null,null,null,null,null,null,null,null,null,null,null,null,null,{"$f":"IF(AI419<>\"\",COUNTA($AI$2:$AI419),\"\")","v":""},null,null,null,"",null,"",null,0]
[null,null,null,null,null,null,null,null,null,null,null,null,null,null,null,null,null,null,null,null,null,null,null,null,null,null,null,null,null,null,null,null,null,{"$f":"IF(AI420<>\"\",COUNTA($AI$2:$AI420),\"\")","v":""},null,null,null,"",null,"",null,0]
[null,null,null,null,null,null,null,null,null,null,null,null,null,null,null,null,null,null,null,null,null,null,null,null,null,null,null,null,null,null,null,null,null,{"$f":"IF(AI421<>\"\",COUNTA($AI$2:$AI421),\"\")","v":""},null,null,null,"",null,"",null,0]
[null,null,null,null,null,null,null,null,null,null,null,null,null,null,null,null,null,null,null,null,null,null,null,null,null,null,null,null,null,null,null,null,null,{"$f":"IF(AI422<>\"\",COUNTA($AI$2:$AI422),\"\")","v":""},null,null,null,"",null,"",null,0]
[null,null,null,null,null,null,null,null,null,null,null,null,null,null,null,null,null,null,null,null,null,null,null,null,null,null,null,null,null,null,null,null,null,{"$f":"IF(AI423<>\"\",COUNTA($AI$2:$AI423),\"\")","v":""},null,null,null,"",null,"",null,0]
[null,null,null,null,null,null,null,null,null,null,null,null,null,null,null,null,null,null,null,null,null,null,null,null,null,null,null,null,null,null,null,null,null,{"$f":"IF(AI424<>\"\",COUNTA($AI$2:$AI424),\"\")","v":""},null,null,null,"",null,"",null,0]
[null,null,null,null,null,null,null,null,null,null,null,null,null,null,null,null,null,null,null,null,null,null,null,null,null,null,null,null,null,null,null,null,null,{"$f":"IF(AI425<>\"\",COUNTA($AI$2:$AI425),\"\")","v":""},null,null,null,"",null,"",null,0]
[null,null,null,null,null,null,null,null,null,null,null,null,null,null,null,null,null,null,null,null,null,null,null,null,null,null,null,null,null,null,null,null,null,{"$f":"IF(AI426<>\"\",COUNTA($AI$2:$AI426),\"\")","v":""},null,null,null,"",null,"",null,0]
[null,null,null,null,null,null,null,null,null,null,null,null,null,null,null,null,null,null,null,null,null,null,null,null,null,null,null,null,null,null,null,null,null,{"$f":"IF(AI427<>\"\",COUNTA($AI$2:$AI427),\"\")","v":""},null,null,null,"",null,"",null,0]
[null,null,null,null,null,null,null,null,null,null,null,null,null,null,null,null,null,null,null,null,null,null,null,null,null,null,null,null,null,null,null,null,null,{"$f":"IF(AI428<>\"\",COUNTA($AI$2:$AI428),\"\")","v":""},null,null,null,"",null,"",null,0]
[null,null,null,null,null,null,null,null,null,null,null,null,null,null,null,null,null,null,null,null,null,null,null,null,null,null,null,null,null,null,null,null,null,{"$f":"IF(AI429<>\"\",COUNTA($AI$2:$AI429),\"\")","v":""},null,null,null,"",null,"",null,0]
[null,null,null,null,null,null,null,null,null,null,null,null,null,null,null,null,null,null,null,null,null,null,null,null,null,null,null,null,null,null,null,null,null,{"$f":"IF(AI430<>\"\",COUNTA($AI$2:$AI430),\"\")","v":""},null,null,null,"",null,"",null,0]
[null,null,null,null,null,null,null,null,null,null,null,null,null,null,null,null,null,null,null,null,null,null,null,null,null,null,null,null,null,null,null,null,null,{"$f":"IF(AI431<>\"\",COUNTA($AI$2:$AI431),\"\")","v":""},null,null,null,"",null,"",null,0]
[null,null,null,null,null,null,null,null,null,null,null,null,null,null,null,null,null,null,null,null,null,null,null,null,null,null,null,null,null,null,null,null,null,{"$f":"IF(AI432<>\"\",COUNTA($AI$2:$AI432),\"\")","v":""},null,null,null,"",null,"",null,0]
[null,null,null,null,null,null,null,null,null,null,null,null,null,null,null,null,null,null,null,null,null,null,null,null,null,null,null,null,null,null,null,null,null,{"$f":"IF(AI433<>\"\",COUNTA($AI$2:$AI433),\"\")","v":""},null,null,null,"",null,"",null,0]
[null,null,null,null,null,null,null,null,null,null,null,null,null,null,null,null,null,null,null,null,null,null,null,null,null,null,null,null,null,null,null,null,null,{"$f":"IF(AI434<>\"\",COUNTA($AI$2:$AI434),\"\")","v":""},null,null,null,"",null,"",null,0]
[null,null,null,null,null,null,null,null,null,null,null,null,null,null,null,null,null,null,null,null,null,null,null,null,null,null,null,null,null,null,null,null,null,{"$f":"IF(AI435<>\"\",COUNTA($AI$2:$AI435),\"\")","v":""},null,null,null,"",null,"",null,0]
[null,null,null,null,null,null,null,null,null,null,null,null,null,null,null,null,null,null,null,null,null,null,null,null,null,null,null,null,null,null,null,null,null,{"$f":"IF(AI436<>\"\",COUNTA($AI$2:$AI436),\"\")","v":""},null,null,null,"",null,"",null,0]
[null,null,null,null,null,null,null,null,null,null,null,null,null,null,null,null,null,null,null,null,null,null,null,null,null,null,null,null,null,null,null,null,null,{"$f":"IF(AI437<>\"\",COUNTA($AI$2:$AI437),\"\")","v":""},null,null,null,"",null,"",null,0]
[null,null,null,null,null,null,null,null,null,null,null,null,null,null,null,null,null,null,null,null,null,null,null,null,null,null,null,null,null,null,null,null,null,{"$f":"IF(AI438<>\"\",COUNTA($AI$2:$AI438),\"\")","v":""},null,null,null,"",null,"",null,0]
[null,null,null,null,null,null,null,null,null,null,null,null,null,null,null,null,null,null,null,null,null,null,null,null,null,null,null,null,null,null,null,null,null,{"$f":"IF(AI439<>\"\",COUNTA($AI$2:$AI439),\"\")","v":""},null,null,null,"",null,"",null,0]
[null,null,null,null,null,null,null,null,null,null,null,null,null,null,null,null,null,null,null,null,null,null,null,null,null,null,null,null,null,null,null,null,null,{"$f":"IF(AI440<>\"\",COUNTA($AI$2:$AI440),\"\")","v":""},null,null,null,"",null,"",null,0]
[null,null,null,null,null,null,null,null,null,null,null,null,null,null,null,null,null,null,null,null,null,null,null,null,null,null,null,null,null,null,null,null,null,{"$f":"IF(AI441<>\"\",COUNTA($AI$2:$AI441),\"\")","v":""},null,null,null,"",null,"",null,0]
[null,null,null,null,null,null,null,null,null,null,null,null,null,null,null,null,null,null,null,null,null,null,null,null,null,null,null,null,null,null,null,null,null,{"$f":"IF(AI442<>\"\",COUNTA($AI$2:$AI442),\"\")","v":""},null,null,null,"",null,"",null,0]
[null,null,null,null,null,null,null,null,null,null,null,null,null,null,null,null,null,null,null,null,null,null,null,null,null,null,null,null,null,null,null,null,null,{"$f":"IF(AI443<>\"\",COUNTA($AI$2:$AI443),\"\")","v":""},null,null,null,"",null,"",null,0]
[null,null,null,null,null,null,null,null,null,null,null,null,null,null,null,null,null,null,null,null,null,null,null,null,null,null,null,null,null,null,null,null,null,{"$f":"IF(AI444<>\"\",COUNTA($AI$2:$AI444),\"\")","v":""},null,null,null,"",null,"",null,0]
[null,null,null,null,null,null,null,null,null,null,null,null,null,null,null,null,null,null,null,null,null,null,null,null,null,null,null,null,null,null,null,null,null,{"$f":"IF(AI445<>\"\",COUNTA($AI$2:$AI445),\"\")","v":""},null,null,null,"",null,"",null,0]
[null,null,null,null,null,null,null,null,null,null,null,null,null,null,null,null,null,null,null,null,null,null,null,null,null,null,null,null,null,null,null,null,null,{"$f":"IF(AI446<>\"\",COUNTA($AI$2:$AI446),\"\")","v":""},null,null,null,"",null,"",null,0]
[null,null,null,null,null,null,null,null,null,null,null,null,null,null,null,null,null,null,null,null,null,null,null,null,null,null,null,null,null,null,null,null,null,{"$f":"IF(AI447<>\"\",COUNTA($AI$2:$AI447),\"\")","v":""},null,null,null,"",null,"",null,0]
[null,null,null,null,null,null,null,null,null,null,null,null,null,null,null,null,null,null,null,null,null,null,null,null,null,null,null,null,null,null,null,null,null,{"$f":"IF(AI448<>\"\",COUNTA($AI$2:$AI448),\"\")","v":""},null,null,null,"",null,"",null,0]
[null,null,null,null,null,null,null,null,null,null,null,null,null,null,null,null,null,null,null,null,null,null,null,null,null,null,null,null,null,null,null,null,null,{"$f":"IF(AI449<>\"\",COUNTA($AI$2:$AI449),\"\")","v":""},null,null,null,"",null,"",null,0]
[null,null,null,null,null,null,null,null,null,null,null,null,null,null,null,null,null,null,null,null,null,null,null,null,null,null,null,null,null,null,null,null,null,{"$f":"IF(AI450<>\"\",COUNTA($AI$2:$AI450),\"\")","v":""},null,null,null,{"$f":"IFERROR(IF(AI450=\"\",\"\",IF(AJ450=\"gesetzt\",RAND()*5000000,RAND()*1000*20)),\"\")","v":""},null,"",null,0]
[null,null,null,null,null,null,null,null,null,null,null,null,null,null,null,null,null,null,null,null,null,null,null,null,null,null,null,null,null,null,null,null,null,{"$f":"IF(AI451<>\"\",COUNTA($AI$2:$AI451),\"\")","v":""},null,null,null,"",null,{"$f":"IF(AJ451=\"\",\"\",AJ451)","v":""},null,{"$f":"IF(AN451=\"gesetzt\",1,0)","v":0}]
[null,null,null,null,null,null,null,null,null,null,null,null,null,null,null,null,null,null,null,null,null,null,null,null,null,null,null,null,null,null,null,null,null,{"$f":"IF(AI452<>\"\",COUNTA($AI$2:$AI452),\"\")","v":""},null,null,null,"",null,"",null,0]
[null,null,null,null,null,null,null,null,null,null,null,null,null,null,null,null,null,null,null,null,null,null,null,null,null,null,null,null,null,null,null,null,null,{"$f":"IF(AI453<>\"\",COUNTA($AI$2:$AI453),\"\")","v":""},null,null,null,"",null,"",null,0]
[null,null,null,null,null,null,null,null,null,null,null,null,null,null,null,null,null,null,null,null,null,null,null,null,null,null,null,null,null,null,null,null,null,{"$f":"IF(AI454<>\"\",COUNTA($AI$2:$AI454),\"\")","v":""},null,null,null,"",null,"",null,0]
[null,null,null,null,null,null,null,null,null,null,null,null,null,null,null,null,null,null,null,null,null,null,null,null,null,null,null,null,null,null,null,null,null,{"$f":"IF(AI455<>\"\",COUNTA($AI$2:$AI455),\"\")","v":""},null,null,null,"",null,"",null,0]
[null,null,null,null,null,null,null,null,null,null,null,null,null,null,null,null,null,null,null,null,null,null,null,null,null,null,null,null,null,null,null,null,null,{"$f":"IF(AI456<>\"\",COUNTA($AI$2:$AI456),\"\")","v":""},null,null,null,"",null,"",null,0]
[null,null,null,null,null,null,null,null,null,null,null,null,null,null,null,null,null,null,null,null,null,null,null,null,null,null,null,null,null,null,null,null,null,{"$f":"IF(AI457<>\"\",COUNTA($AI$2:$AI457),\"\")","v":""},null,null,null,"",null,"",null,0]
[null,null,null,null,null,null,null,null,null,null,null,null,null,null,null,null,null,null,null,null,null,null,null,null,null,null,null,null,null,null,null,null,null,{"$f":"IF(AI458<>\"\",COUNTA($AI$2:$AI458),\"\")","v":""},null,null,null,"",null,"",null,0]
[null,null,null,null,null,null,null,null,null,null,null,null,null,null,null,null,null,null,null,null,null,null,null,null,null,null,null,null,null,null,null,null,null,{"$f":"IF(AI459<>\"\",COUNTA($AI$2:$AI459),\"\")","v":""},null,null,null,"",null,"",null,0]
[null,null,null,null,null,null,null,null,null,null,null,null,null,null,null,null,null,null,null,null,null,null,null,null,null,null,null,null,null,null,null,null,null,{"$f":"IF(AI460<>\"\",COUNTA($AI$2:$AI460),\"\")","v":""},null,null,null,"",null,"",null,0]
[null,null,null,null,null,null,null,null,null,null,null,null,null,null,null,null,null,null,null,null,null,null,null,null,null,null,null,null,null,null,null,null,null,{"$f":"IF(AI461<>\"\",COUNTA($AI$2:$AI461),\"\")","v":""},null,null,null,"",null,"",null,0]
[null,null,null,null,null,null,null,null,null,null,null,null,null,null,null,null,null,null,null,null,null,null,null,null,null,null,null,null,null,null,null,null,null,{"$f":"IF(AI462<>\"\",COUNTA($AI$2:$AI462),\"\")","v":""},null,null,null,"",null,"",null,0]
[null,null,null,null,null,null,null,null,null,null,null,null,null,null,null,null,null,null,null,null,null,null,null,null,null,null,null,null,null,null,null,null,null,{"$f":"IF(AI463<>\"\",COUNTA($AI$2:$AI463),\"\")","v":""},null,null,null,"",null,"",null,0]
[null,null,null,null,null,null,null,null,null,null,null,null,null,null,null,null,null,null,null,null,null,null,null,null,null,null,null,null,null,null,null,null,null,{"$f":"IF(AI464<>\"\",COUNTA($AI$2:$AI464),\"\")","v":""},null,null,null,"",null,"",null,0]
[null,null,null,null,null,null,null,null,null,null,null,null,null,null,null,null,null,null,null,null,null,null,null,null,null,null,null,null,null,null,null,null,null,{"$f":"IF(AI465<>\"\",COUNTA($AI$2:$AI465),\"\")","v":""},null,null,null,"",null,"",null,0]
[null,null,null,null,null,null,null,null,null,null,null,null,null,null,null,null,null,null,null,null,null,null,null,null,null,null,null,null,null,null,null,null,null,{"$f":"IF(AI466<>\"\",COUNTA($AI$2:$AI466),\"\")","v":""},null,null,null,"",null,"",null,0]
[null,null,null,null,null,null,null,null,null,null,null,null,null,null,null,null,null,null,null,null,null,null,null,null,null,null,null,null,null,null,null,null,null,{"$f":"IF(AI467<>\"\",COUNTA($AI$2:$AI467),\"\")","v":""},null,null,null,"",null,"",null,0]
[null,null,null,null,null,null,null,null,null,null,null,null,null,null,null,null,null,null,null,null,null,null,null,null,null,null,null,null,null,null,null,null,null,{"$f":"IF(AI468<>\"\",COUNTA($AI$2:$AI468),\"\")","v":""},null,null,null,"",null,"",null,0]
[null,null,null,null,null,null,null,null,null,null,null,null,null,null,null,null,null,null,null,null,null,null,null,null,null,null,null,null,null,null,null,null,null,{"$f":"IF(AI469<>\"\",COUNTA($AI$2:$AI469),\"\")","v":""},null,null,null,"",null,"",null,0]
[null,null,null,null,null,null,null,null,null,null,null,null,null,null,null,null,null,null,null,null,null,null,null,null,null,null,null,null,null,null,null,null,null,{"$f":"IF(AI470<>\"\",COUNTA($AI$2:$AI470),\"\")","v":""},null,null,null,"",null,"",null,0]
[null,null,null,null,null,null,null,null,null,null,null,null,null,null,null,null,null,null,null,null,null,null,null,null,null,null,null,null,null,null,null,null,null,{"$f":"IF(AI471<>\"\",COUNTA($AI$2:$AI471),\"\")","v":""},null,null,null,"",null,"",null,0]
[null,null,null,null,null,null,null,null,null,null,null,null,null,null,null,null,null,null,null,null,null,null,null,null,null,null,null,null,null,null,null,null,null,{"$f":"IF(AI472<>\"\",COUNTA($AI$2:$AI472),\"\")","v":""},null,null,null,"",null,"",null,0]
[null,null,null,null,null,null,null,null,null,null,null,null,null,null,null,null,null,null,null,null,null,null,null,null,null,null,null,null,null,null,null,null,null,{"$f":"IF(AI473<>\"\",COUNTA($AI$2:$AI473),\"\")","v":""},null,null,null,"",null,"",null,0]
[null,null,null,null,null,null,null,null,null,null,null,null,null,null,null,null,null,null,null,null,null,null,null,null,null,null,null,null,null,null,null,null,null,{"$f":"IF(AI474<>\"\",COUNTA($AI$2:$AI474),\"\")","v":""},null,null,null,"",null,"",null,0]
[null,null,null,null,null,null,null,null,null,null,null,null,null,null,null,null,null,null,null,null,null,null,null,null,null,null,null,null,null,null,null,null,null,{"$f":"IF(AI475<>\"\",COUNTA($AI$2:$AI475),\"\")","v":""},null,null,null,"",null,"",null,0]
[null,null,null,null,null,null,null,null,null,null,null,null,null,null,null,null,null,null,null,null,null,null,null,null,null,null,null,null,null,null,null,null,null,{"$f":"IF(AI476<>\"\",COUNTA($AI$2:$AI476),\"\")","v":""},null,null,null,"",null,"",null,0]
[null,null,null,null,null,null,null,null,null,null,null,null,null,null,null,null,null,null,null,null,null,null,null,null,null,null,null,null,null,null,null,null,null,{"$f":"IF(AI477<>\"\",COUNTA($AI$2:$AI477),\"\")","v":""},null,null,null,"",null,"",null,0]
[null,null,null,null,null,null,null,null,null,null,null,null,null,null,null,null,null,null,null,null,null,null,null,null,null,null,null,null,null,null,null,null,null,{"$f":"IF(AI478<>\"\",COUNTA($AI$2:$AI478),\"\")","v":""},null,null,null,"",null,"",null,0]
[null,null,null,null,null,null,null,null,null,null,null,null,null,null,null,null,null,null,null,null,null,null,null,null,null,null,null,null,null,null,null,null,null,{"$f":"IF(AI479<>\"\",COUNTA($AI$2:$AI479),\"\")","v":""},null,null,null,"",null,"",null,0]
[null,null,null,null,null,null,null,null,null,null,null,null,null,null,null,null,null,null,null,null,null,null,null,null,null,null,null,null,null,null,null,null,null,{"$f":"IF(AI480<>\"\",COUNTA($AI$2:$AI480),\"\")","v":""},null,null,null,"",null,"",null,0]
[null,null,null,null,null,null,null,null,null,null,null,null,null,null,null,null,null,null,null,null,null,null,null,null,null,null,null,null,null,null,null,null,null,{"$f":"IF(AI481<>\"\",COUNTA($AI$2:$AI481),\"\")","v":""},null,null,null,"",null,"",null,0]
[null,null,null,null,null,null,null,null,null,null,null,null,null,null,null,null,null,null,null,null,null,null,null,null,null,null,null,null,null,null,null,null,null,{"$f":"IF(AI482<>\"\",COUNTA($AI$2:$AI482),\"\")","v":""},null,null,null,"",null,"",null,0]
[null,null,null,null,null,null,null,null,null,null,null,null,null,null,null,null,null,null,null,null,null,null,null,null,null,null,null,null,null,null,null,null,null,{"$f":"IF(AI483<>\"\",COUNTA($AI$2:$AI483),\"\")","v":""},null,null,null,"",null,"",null,0]
[null,null,null,null,null,null,null,null,null,null,null,null,null,null,null,null,null,null,null,null,null,null,null,null,null,null,null,null,null,null,null,null,null,{"$f":"IF(AI484<>\"\",COUNTA($AI$2:$AI484),\"\")","v":""},null,null,null,"",null,"",null,0]
[null,null,null,null,null,null,null,null,null,null,null,null,null,null,null,null,null,null,null,null,null,null,null,null,null,null,null,null,null,null,null,null,null,{"$f":"IF(AI485<>\"\",COUNTA($AI$2:$AI485),\"\")","v":""},null,null,null,"",null,"",null,0]
[null,null,null,null,null,null,null,null,null,null,null,null,null,null,null,null,null,null,null,null,null,null,null,null,null,null,null,null,null,null,null,null,null,{"$f":"IF(AI486<>\"\",COUNTA($AI$2:$AI486),\"\")","v":""},null,null,null,"",null,"",null,0]
[null,null,null,null,null,null,null,null,null,null,null,null,null,null,null,null,null,null,null,null,null,null,null,null,null,null,null,null,null,null,null,null,null,{"$f":"IF(AI487<>\"\",COUNTA($AI$2:$AI487),\"\")","v":""},null,null,null,"",null,"",null,0]
[null,null,null,null,null,null,null,null,null,null,null,null,null,null,null,null,null,null,null,null,null,null,null,null,null,null,null,null,null,null,null,null,null,{"$f":"IF(AI488<>\"\",COUNTA($AI$2:$AI488),\"\")","v":""},null,null,null,"",null,"",null,0]
[null,null,null,null,null,null,null,null,null,null,null,null,null,null,null,null,null,null,null,null,null,null,null,null,null,null,null,null,null,null,null,null,null,{"$f":"IF(AI489<>\"\",COUNTA($AI$2:$AI489),\"\")","v":""},null,null,null,"",null,"",null,0]
[null,null,null,null,null,null,null,null,null,null,null,null,null,null,null,null,null,null,null,null,null,null,null,null,null,null,null,null,null,null,null,null,null,{"$f":"IF(AI490<>\"\",COUNTA($AI$2:$AI490),\"\")","v":""},null,null,null,"",null,"",null,0]
[null,null,null,null,null,null,null,null,null,null,null,null,null,null,null,null,null,null,null,null,null,null,null,null,null,null,null,null,null,null,null,null,null,{"$f":"IF(AI491<>\"\",COUNTA($AI$2:$AI491),\"\")","v":""},null,null,null,"",null,"",null,0]
[null,null,null,null,null,null,null,null,null,null,null,null,null,null,null,null,null,null,null,null,null,null,null,null,null,null,null,null,null,null,null,null,null,{"$f":"IF(AI492<>\"\",COUNTA($AI$2:$AI492),\"\")","v":""},null,null,null,"",null,"",null,0]
[null,null,null,null,null,null,null,null,null,null,null,null,null,null,null,null,null,null,null,null,null,null,null,null,null,null,null,null,null,null,null,null,null,{"$f":"IF(AI493<>\"\",COUNTA($AI$2:$AI493),\"\")","v":""},null,null,null,"",null,"",null,0]
[null,null,null,null,null,null,null,null,null,null,null,null,null,null,null,null,null,null,null,null,null,null,null,null,null,null,null,null,null,null,null,null,null,{"$f":"IF(AI494<>\"\",COUNTA($AI$2:$AI494),\"\")","v":""},null,null,null,"",null,"",null,0]
[null,null,null,null,null,null,null,null,null,null,null,null,null,null,null,null,null,null,null,null,null,null,null,null,null,null,null,null,null,null,null,null,null,{"$f":"IF(AI495<>\"\",COUNTA($AI$2:$AI495),\"\")","v":""},null,null,null,"",null,"",null,0]
[null,null,null,null,null,null,null,null,null,null,null,null,null,null,null,null,null,null,null,null,null,null,null,null,null,null,null,null,null,null,null,null,null,{"$f":"IF(AI496<>\"\",COUNTA($AI$2:$AI496),\"\")","v":""},null,null,null,"",null,"",null,0]
[null,null,null,null,null,null,null,null,null,null,null,null,null,null,null,null,null,null,null,null,null,null,null,null,null,null,null,null,null,null,null,null,null,{"$f":"IF(AI497<>\"\",COUNTA($AI$2:$AI497),\"\")","v":""},null,null,null,"",null,"",null,0]
[null,null,null,null,null,null,null,null,null,null,null,null,null,null,null,null,null,null,null,null,null,null,null,null,null,null,null,null,null,null,null,null,null,{"$f":"IF(AI498<>\"\",COUNTA($AI$2:$AI498),\"\")","v":""},null,null,null,"",null,"",null,0]
[null,null,null,null,null,null,null,null,null,null,null,null,null,null,null,null,null,null,null,null,null,null,null,null,null,null,null,null,null,null,null,null,null,{"$f":"IF(AI499<>\"\",COUNTA($AI$2:$AI499),\"\")","v":""},null,null,null,"",null,"",null,0]
[null,null,null,null,null,null,null,null,null,null,null,null,null,null,null,null,null,null,null,null,null,null,null,null,null,null,null,null,null,null,null,null,null,{"$f":"IF(AI500<>\"\",COUNTA($AI$2:$AI500),\"\")","v":""},null,null,null,"",null,"",null,0]
[null,null,null,null,null,null,null,null,null,null,null,null,null,null,null,null,null,null,null,null,null,null,null,null,null,null,null,null,null,null,null,null,null,{"$f":"LARGE(AH2:AH500,1)","v":24},{"$f":"COUNTIF(AI2:AI500,\"OK\")","v":24},null,null,null,null,null,null,{"$f":"SUM(AP2:AP500)","v":0}]

{"sheet":"1. Runde Gruppen","index":1,"n_rows":31,"n_cols":34,"rows_kept":31,"cut":false,"hidden":false,"merged":[[0,1,0,14],[8,1,8,14],[16,1,16,14],[24,1,24,14],[0,17,0,30],[8,17,8,30],[16,17,16,30],[24,17,24,30]]}
[null,"GRUPPE A",null,null,null,null,null,null,null,null,null,null,null,null,null,null,null,"GRUPPE B"]
[{"$f":"IF(AND(CB2=\"\",R2=\"\"),1,0)","v":0},{"$f":"IF(D3=\"\",0,1)","v":1},null,{"$f":"Berechnung!D1","v":"Spieler"},{"$f":"Berechnung!E1","v":"M"},{"$f":"Berechnung!F1","v":"W"},{"$f":"Berechnung!G1","v":"L"},"U",{"$f":"Berechnung!H1","v":"F+"},{"$f":"Berechnung!I1","v":"F-"},{"$f":"Berechnung!K1","v":0},{"$f":"Berechnung!L1","v":0},{"$f":"Berechnung!M1","v":"Rang"},{"$f":"Berechnung!N1","v":"Rang"},{"$f":"Berechnung!O1","v":"P+"},null,null,{"$f":"IF(T3=\"\",0,1)","v":1},null,{"$f":"Berechnung!D12","v":"Spieler"},{"$f":"Berechnung!E12","v":"M"},{"$f":"Berechnung!F12","v":"W"},{"$f":"Berechnung!G12","v":"L"},"U","F+","F-",{"$f":"Berechnung!K12","v":0},{"$f":"Berechnung!L12","v":0},{"$f":"Berechnung!M12","v":"Rang"},{"$f":"Berechnung!N12","v":"Rang"},{"$f":"Berechnung!O12","v":"P+"},null,null,"   speichert unter C:\\Users\\Public\\Videos"]
[{"$f":"IF(AND(B3=\"\",R3=\"\"),1,0)","v":0},{"$f":"IF(D3=\"\",\"\",Berechnung!B2)","v":1},{"$f":"Berechnung!C2","v":"A1"},{"$f":"IFERROR(VLOOKUP(C3,Spieler!$I$2:$J$41,2,FALSE),\"\")","v":"Valderrama Salvador"},{"$f":"Berechnung!E2","v":2},{"$f":"Berechnung!F2","v":1},{"$f":"Berechnung!G2","v":1},{"$f":"Berechnung!J2","v":0},{"$f":"Berechnung!H2","v":3},{"$f":"Berechnung!I2","v":2},{"$f":"Berechnung!K2","v":0},{"$f":"Berechnung!L2","v":0},{"$f":"Berechnung!M2","v":1002},{"$f":"Berechnung!N2","v":2},null,{"$f":"D3","v":"Valderrama Salvador"},155,{"$f":"IF(T3=\"\",\"\",Berechnung!B13)","v":1},{"$f":"Berechnung!C13","v":"B1"},{"$f":"IFERROR(VLOOKUP(S3,Spieler!$I$2:$J$41,2,FALSE),\"\")","v":"Drahn Robert"},{"$f":"Berechnung!E13","v":2},{"$f":"Berechnung!F13","v":1},{"$f":"Berechnung!G13","v":1},{"$f":"Berechnung!J13","v":0},{"$f":"Berechnung!H13","v":2},{"$f":"Berechnung!I13","v":2},{"$f":"Berechnung!K13","v":0},{"$f":"Berechnung!L13","v":0},{"$f":"Berechnung!M13","v":2},{"$f":"Berechnung!N13","v":2},null,{"$f":"T3","v":"Drahn Robert"}]
[{"$f":"IF(AND(B4=\"\",R4=\"\"),1,0)","v":0},{"$f":"IF(D4=\"\",\"\",Berechnung!B3)","v":2},{"$f":"Berechnung!C3","v":"A2"},{"$f":"IFERROR(VLOOKUP(C4,Spieler!$I$2:$J$41,2,FALSE),\"\")","v":"Brachmanski Dave"},{"$f":"Berechnung!E3","v":2},{"$f":"Berechnung!F3","v":0},{"$f":"Berechnung!G3","v":2},{"$f":"Berechnung!J3","v":0},{"$f":"Berechnung!H3","v":1},{"$f":"Berechnung!I3","v":4},{"$f":"Berechnung!K3","v":0},{"$f":"Berechnung!L3","v":0},{"$f":"Berechnung!M3","v":-22998},{"$f":"Berechnung!N3","v":3},null,{"$f":"D4","v":"Brachmanski Dave"},null,{"$f":"IF(T4=\"\",\"\",Berechnung!B14)","v":2},{"$f":"Berechnung!C14","v":"B2"},{"$f":"IFERROR(VLOOKUP(S4,Spieler!$I$2:$J$41,2,FALSE),\"\")","v":"Brömel Frank"},{"$f":"Berechnung!E14","v":2},{"$f":"Berechnung!F14","v":0},{"$f":"Berechnung!G14","v":2},{"$f":"Berechnung!J14","v":0},{"$f":"Berechnung!H14","v":0},{"$f":"Berechnung!I14","v":4},{"$f":"Berechnung!K14","v":0},{"$f":"Berechnung!L14","v":0},{"$f":"Berechnung!M14","v":-23998},{"$f":"Berechnung!N14","v":3},null,{"$f":"T4","v":"Brömel Frank"}]
[{"$f":"IF(AND(B5=\"\",R5=\"\"),1,0)","v":0},{"$f":"IF(D5=\"\",\"\",Berechnung!B4)","v":3},{"$f":"Berechnung!C4","v":"A3"},{"$f":"IFERROR(VLOOKUP(C5,Spieler!$I$2:$J$41,2,FALSE),\"\")","v":"Gärtner David"},{"$f":"Berechnung!E4","v":2},{"$f":"Berechnung!F4","v":2},{"$f":"Berechnung!G4","v":0},{"$f":"Berechnung!J4","v":0},{"$f":"Berechnung!H4","v":4},{"$f":"Berechnung!I4","v":2},{"$f":"Berechnung!K4","v":0},{"$f":"Berechnung!L4","v":0},{"$f":"Berechnung!M4","v":22002},{"$f":"Berechnung!N4","v":1},null,{"$f":"D5","v":"Gärtner David"},null,{"$f":"IF(T5=\"\",\"\",Berechnung!B15)","v":3},{"$f":"Berechnung!C15","v":"B3"},{"$f":"IFERROR(VLOOKUP(S5,Spieler!$I$2:$J$41,2,FALSE),\"\")","v":"Weber Marco"},{"$f":"Berechnung!E15","v":2},{"$f":"Berechnung!F15","v":2},{"$f":"Berechnung!G15","v":0},{"$f":"Berechnung!J15","v":0},{"$f":"Berechnung!H15","v":4},{"$f":"Berechnung!I15","v":0},{"$f":"Berechnung!K15","v":0},{"$f":"Berechnung!L15","v":0},{"$f":"Berechnung!M15","v":24002},{"$f":"Berechnung!N15","v":1},null,{"$f":"T5","v":"Weber Marco"}]
[{"$f":"IF(AND(B6=\"\",R6=\"\"),1,0)","v":1},{"$f":"IF(D6=\"\",\"\",Berechnung!B5)","v":""},{"$f":"Berechnung!C5","v":"A4"},{"$f":"IFERROR(VLOOKUP(C6,Spieler!$I$2:$J$41,2,FALSE),\"\")","v":""},{"$f":"Berechnung!E5","v":0},{"$f":"Berechnung!F5","v":0},{"$f":"Berechnung!G5","v":0},{"$f":"Berechnung!J5","v":0},{"$f":"Berechnung!H5","v":0},{"$f":"Berechnung!I5","v":0},{"$f":"Berechnung!K5","v":0},{"$f":"Berechnung!L5","v":0},{"$f":"Berechnung!M5","v":-200000},{"$f":"Berechnung!N5","v":""},null,{"$f":"D6","v":""},null,{"$f":"IF(T6=\"\",\"\",Berechnung!B16)","v":""},{"$f":"Berechnung!C16","v":"B4"},{"$f":"IFERROR(VLOOKUP(S6,Spieler!$I$2:$J$41,2,FALSE),\"\")","v":""},{"$f":"Berechnung!E16","v":0},{"$f":"Berechnung!F16","v":0},{"$f":"Berechnung!G16","v":0},{"$f":"Berechnung!J16","v":0},{"$f":"Berechnung!H16","v":0},{"$f":"Berechnung!I16","v":0},{"$f":"Berechnung!K16","v":0},{"$f":"Berechnung!L16","v":0},{"$f":"Berechnung!M16","v":-200000},{"$f":"Berechnung!N16","v":""},null,{"$f":"T6","v":""}]
[{"$f":"IF(AND(B7=\"\",R7=\"\"),1,0)","v":1},{"$f":"IF(D7=\"\",\"\",Berechnung!B6)","v":""},{"$f":"Berechnung!C6","v":"A5"},{"$f":"IFERROR(VLOOKUP(C7,Spieler!$I$2:$J$41,2,FALSE),\"\")","v":""},{"$f":"Berechnung!E6","v":0},{"$f":"Berechnung!F6","v":0},{"$f":"Berechnung!G6","v":0},{"$f":"Berechnung!J6","v":0},{"$f":"Berechnung!H6","v":0},{"$f":"Berechnung!I6","v":0},{"$f":"Berechnung!K6","v":0},{"$f":"Berechnung!L6","v":0},{"$f":"Berechnung!M6","v":-200000},{"$f":"Berechnung!N6","v":""},null,{"$f":"D7","v":""},null,{"$f":"IF(T7=\"\",\"\",Berechnung!B17)","v":""},{"$f":"Berechnung!C17","v":"B5"},{"$f":"IFERROR(VLOOKUP(S7,Spieler!$I$2:$J$41,2,FALSE),\"\")","v":""},{"$f":"Berechnung!E17","v":0},{"$f":"Berechnung!F17","v":0},{"$f":"Berechnung!G17","v":0},{"$f":"Berechnung!J17","v":0},{"$f":"Berechnung!H17","v":0},{"$f":"Berechnung!I17","v":0},{"$f":"Berechnung!K17","v":0},{"$f":"Berechnung!L17","v":0},{"$f":"Berechnung!M17","v":-200000},{"$f":"Berechnung!N17","v":""},null,{"$f":"T7","v":""}]
[]
[0,"GRUPPE C",null,null,null,null,null,null,null,null,null,null,null,null,null,null,"aktualisiert um:","GRUPPE D"]
[0,{"$f":"IF(D11=\"\",0,1)","v":1},null,{"$f":"Berechnung!D23","v":"Spieler"},{"$f":"Berechnung!E23","v":"M"},{"$f":"Berechnung!F23","v":"W"},{"$f":"Berechnung!G23","v":"L"},"U","F+","F-",{"$f":"Berechnung!K23","v":0},{"$f":"Berechnung!L23","v":0},{"$f":"Berechnung!M23","v":"Rang"},{"$f":"Berechnung!N23","v":"Rang"},{"$f":"Berechnung!O23","v":"P+"},null,{"$f":"NOW()-TODAY()","v":"12:39:24.400"},{"$f":"IF(T11=\"\",0,1)","v":1},null,{"$f":"Berechnung!D34","v":"Spieler"},{"$f":"Berechnung!E34","v":"M"},{"$f":"Berechnung!F34","v":"W"},{"$f":"Berechnung!G34","v":"L"},"U","F+","F-",{"$f":"Berechnung!K34","v":0},{"$f":"Berechnung!L34","v":0},{"$f":"Berechnung!M34","v":"Rang"},{"$f":"Berechnung!N34","v":"Rang"},{"$f":"Berechnung!O34","v":"P+"}]
[0,{"$f":"IF(D11=\"\",\"\",Berechnung!B24)","v":1},{"$f":"Berechnung!C24","v":"C1"},{"$f":"IFERROR(VLOOKUP(C11,Spieler!$I$2:$J$41,2,FALSE),\"\")","v":"Behling Oliver"},{"$f":"Berechnung!E24","v":2},{"$f":"Berechnung!F24","v":1},{"$f":"Berechnung!G24","v":1},{"$f":"Berechnung!J24","v":0},{"$f":"Berechnung!H24","v":2},{"$f":"Berechnung!I24","v":2},{"$f":"Berechnung!K24","v":0},{"$f":"Berechnung!L24","v":0},{"$f":"Berechnung!M24","v":2},{"$f":"Berechnung!N24","v":2},null,{"$f":"D11","v":"Behling Oliver"},{"$f":"IF(OR(T11=\"\",T11=0),5,0)","v":0},{"$f":"IF(T11=\"\",\"\",Berechnung!B35)","v":1},{"$f":"Berechnung!C35","v":"D1"},{"$f":"IFERROR(VLOOKUP(S11,Spieler!$I$2:$J$41,2,FALSE),\"\")","v":"Hartung Andreas"},{"$f":"Berechnung!E35","v":2},{"$f":"Berechnung!F35","v":0},{"$f":"Berechnung!G35","v":2},{"$f":"Berechnung!J35","v":0},{"$f":"Berechnung!H35","v":1},{"$f":"Berechnung!I35","v":4},{"$f":"Berechnung!K35","v":0},{"$f":"Berechnung!L35","v":0},{"$f":"Berechnung!M35","v":-22998},{"$f":"Berechnung!N35","v":3},null,{"$f":"T11","v":"Hartung Andreas"}]
[0,{"$f":"IF(D12=\"\",\"\",Berechnung!B25)","v":2},{"$f":"Berechnung!C25","v":"C2"},{"$f":"IFERROR(VLOOKUP(C12,Spieler!$I$2:$J$41,2,FALSE),\"\")","v":"Witzik Oliver"},{"$f":"Berechnung!E25","v":2},{"$f":"Berechnung!F25","v":2},{"$f":"Berechnung!G25","v":0},{"$f":"Berechnung!J25","v":0},{"$f":"Berechnung!H25","v":4},{"$f":"Berechnung!I25","v":0},{"$f":"Berechnung!K25","v":0},{"$f":"Berechnung!L25","v":0},{"$f":"Berechnung!M25","v":24002},{"$f":"Berechnung!N25","v":1},null,{"$f":"D12","v":"Witzik Oliver"},null,{"$f":"IF(T12=\"\",\"\",Berechnung!B36)","v":2},{"$f":"Berechnung!C36","v":"D2"},{"$f":"IFERROR(VLOOKUP(S12,Spieler!$I$2:$J$41,2,FALSE),\"\")","v":"Suttner Magnus"},{"$f":"Berechnung!E36","v":2},{"$f":"Berechnung!F36","v":1},{"$f":"Berechnung!G36","v":1},{"$f":"Berechnung!J36","v":0},{"$f":"Berechnung!H36","v":3},{"$f":"Berechnung!I36","v":2},{"$f":"Berechnung!K36","v":0},{"$f":"Berechnung!L36","v":0},{"$f":"Berechnung!M36","v":1002},{"$f":"Berechnung!N36","v":2},null,{"$f":"T12","v":"Suttner Magnus"}]
[0,{"$f":"IF(D13=\"\",\"\",Berechnung!B26)","v":3},{"$f":"Berechnung!C26","v":"C3"},{"$f":"IFERROR(VLOOKUP(C13,Spieler!$I$2:$J$41,2,FALSE),\"\")","v":"Isermann Rene"},{"$f":"Berechnung!E26","v":2},{"$f":"Berechnung!F26","v":0},{"$f":"Berechnung!G26","v":2},{"$f":"Berechnung!J26","v":0},{"$f":"Berechnung!H26","v":0},{"$f":"Berechnung!I26","v":4},{"$f":"Berechnung!K26","v":0},{"$f":"Berechnung!L26","v":0},{"$f":"Berechnung!M26","v":-23998},{"$f":"Berechnung!N26","v":3},null,{"$f":"D13","v":"Isermann Rene"},null,{"$f":"IF(T13=\"\",\"\",Berechnung!B37)","v":3},{"$f":"Berechnung!C37","v":"D3"},{"$f":"IFERROR(VLOOKUP(S13,Spieler!$I$2:$J$41,2,FALSE),\"\")","v":"Straßburger Marko"},{"$f":"Berechnung!E37","v":2},{"$f":"Berechnung!F37","v":2},{"$f":"Berechnung!G37","v":0},{"$f":"Berechnung!J37","v":0},{"$f":"Berechnung!H37","v":4},{"$f":"Berechnung!I37","v":2},{"$f":"Berechnung!K37","v":0},{"$f":"Berechnung!L37","v":0},{"$f":"Berechnung!M37","v":22002},{"$f":"Berechnung!N37","v":1},null,{"$f":"T13","v":"Straßburger Marko"}]
[1,{"$f":"IF(D14=\"\",\"\",Berechnung!B27)","v":""},{"$f":"Berechnung!C27","v":"C4"},{"$f":"IFERROR(VLOOKUP(C14,Spieler!$I$2:$J$41,2,FALSE),\"\")","v":""},{"$f":"Berechnung!E27","v":0},{"$f":"Berechnung!F27","v":0},{"$f":"Berechnung!G27","v":0},{"$f":"Berechnung!J27","v":0},{"$f":"Berechnung!H27","v":0},{"$f":"Berechnung!I27","v":0},{"$f":"Berechnung!K27","v":0},{"$f":"Berechnung!L27","v":0},{"$f":"Berechnung!M27","v":-200000},{"$f":"Berechnung!N27","v":""},null,{"$f":"D14","v":""},null,{"$f":"IF(T14=\"\",\"\",Berechnung!B38)","v":""},{"$f":"Berechnung!C38","v":"D4"},{"$f":"IFERROR(VLOOKUP(S14,Spieler!$I$2:$J$41,2,FALSE),\"\")","v":""},{"$f":"Berechnung!E38","v":0},{"$f":"Berechnung!F38","v":0},{"$f":"Berechnung!G38","v":0},{"$f":"Berechnung!J38","v":0},{"$f":"Berechnung!H38","v":0},{"$f":"Berechnung!I38","v":0},{"$f":"Berechnung!K38","v":0},{"$f":"Berechnung!L38","v":0},{"$f":"Berechnung!M38","v":-200000},{"$f":"Berechnung!N38","v":""},null,{"$f":"T14","v":""}]
[1,{"$f":"IF(D15=\"\",\"\",Berechnung!B28)","v":""},{"$f":"Berechnung!C28","v":"C5"},{"$f":"IFERROR(VLOOKUP(C15,Spieler!$I$2:$J$41,2,FALSE),\"\")","v":""},{"$f":"Berechnung!E28","v":0},{"$f":"Berechnung!F28","v":0},{"$f":"Berechnung!G28","v":0},{"$f":"Berechnung!J28","v":0},{"$f":"Berechnung!H28","v":0},{"$f":"Berechnung!I28","v":0},{"$f":"Berechnung!K28","v":0},{"$f":"Berechnung!L28","v":0},{"$f":"Berechnung!M28","v":-200000},{"$f":"Berechnung!N28","v":""},null,{"$f":"D15","v":""},null,{"$f":"IF(T15=\"\",\"\",Berechnung!B39)","v":""},{"$f":"Berechnung!C39","v":"D5"},{"$f":"IFERROR(VLOOKUP(S15,Spieler!$I$2:$J$41,2,FALSE),\"\")","v":""},{"$f":"Berechnung!E39","v":0},{"$f":"Berechnung!F39","v":0},{"$f":"Berechnung!G39","v":0},{"$f":"Berechnung!J39","v":0},{"$f":"Berechnung!H39","v":0},{"$f":"Berechnung!I39","v":0},{"$f":"Berechnung!K39","v":0},{"$f":"Berechnung!L39","v":0},{"$f":"Berechnung!M39","v":-200000},{"$f":"Berechnung!N39","v":""},null,{"$f":"T15","v":""}]
[]
[0,"GRUPPE E",null,null,null,null,null,null,null,null,null,null,null,null,null,null,null,"GRUPPE F"]
[0,{"$f":"IF(D19=\"\",0,1)","v":1},null,{"$f":"Berechnung!D45","v":"Spieler"},{"$f":"Berechnung!E45","v":"M"},{"$f":"Berechnung!F45","v":"W"},{"$f":"Berechnung!G45","v":"L"},"U","F+","F-",{"$f":"Berechnung!K45","v":0},{"$f":"Berechnung!L45","v":0},{"$f":"Berechnung!M45","v":"Rang"},{"$f":"Berechnung!N45","v":"Rang"},{"$f":"Berechnung!O45","v":"P+"},null,null,{"$f":"IF(T19=\"\",0,1)","v":1},null,{"$f":"Berechnung!D56","v":"Spieler"},{"$f":"Berechnung!E56","v":"M"},{"$f":"Berechnung!F56","v":"W"},{"$f":"Berechnung!G56","v":"L"},"U","F+","F-",{"$f":"Berechnung!K56","v":0},{"$f":"Berechnung!L56","v":0},{"$f":"Berechnung!M56","v":"Rang"},{"$f":"Berechnung!N56","v":"Rang"},{"$f":"Berechnung!O56","v":"P+"}]
[0,{"$f":"IF(D19=\"\",\"\",Berechnung!B46)","v":1},{"$f":"Berechnung!C46","v":"E1"},{"$f":"IFERROR(VLOOKUP(C19,Spieler!$I$2:$J$41,2,FALSE),\"\")","v":"Swennen Andy"},{"$f":"Berechnung!E46","v":2},{"$f":"Berechnung!F46","v":0},{"$f":"Berechnung!G46","v":2},{"$f":"Berechnung!J46","v":0},{"$f":"Berechnung!H46","v":0},{"$f":"Berechnung!I46","v":4},{"$f":"Berechnung!K46","v":0},{"$f":"Berechnung!L46","v":0},{"$f":"Berechnung!M46","v":-23998},{"$f":"Berechnung!N46","v":3},null,{"$f":"D19","v":"Swennen Andy"},{"$f":"IF(OR(T19=\"\",T19=0),7,0)","v":0},{"$f":"IF(T19=\"\",\"\",Berechnung!B57)","v":1},{"$f":"Berechnung!C57","v":"F1"},{"$f":"IFERROR(VLOOKUP(S19,Spieler!$I$2:$J$41,2,FALSE),\"\")","v":"Jeroch Paul"},{"$f":"Berechnung!E57","v":2},{"$f":"Berechnung!F57","v":2},{"$f":"Berechnung!G57","v":0},{"$f":"Berechnung!J57","v":0},{"$f":"Berechnung!H57","v":4},{"$f":"Berechnung!I57","v":1},{"$f":"Berechnung!K57","v":0},{"$f":"Berechnung!L57","v":0},{"$f":"Berechnung!M57","v":23002},{"$f":"Berechnung!N57","v":1},null,{"$f":"T19","v":"Jeroch Paul"}]
[0,{"$f":"IF(D20=\"\",\"\",Berechnung!B47)","v":2},{"$f":"Berechnung!C47","v":"E2"},{"$f":"IFERROR(VLOOKUP(C20,Spieler!$I$2:$J$41,2,FALSE),\"\")","v":"Fandrei Andreas"},{"$f":"Berechnung!E47","v":2},{"$f":"Berechnung!F47","v":1},{"$f":"Berechnung!G47","v":1},{"$f":"Berechnung!J47","v":0},{"$f":"Berechnung!H47","v":2},{"$f":"Berechnung!I47","v":2},{"$f":"Berechnung!K47","v":0},{"$f":"Berechnung!L47","v":0},{"$f":"Berechnung!M47","v":2},{"$f":"Berechnung!N47","v":2},null,{"$f":"D20","v":"Fandrei Andreas"},null,{"$f":"IF(T20=\"\",\"\",Berechnung!B58)","v":2},{"$f":"Berechnung!C58","v":"F2"},{"$f":"IFERROR(VLOOKUP(S20,Spieler!$I$2:$J$41,2,FALSE),\"\")","v":"Müller Marcus"},{"$f":"Berechnung!E58","v":2},{"$f":"Berechnung!F58","v":1},{"$f":"Berechnung!G58","v":1},{"$f":"Berechnung!J58","v":0},{"$f":"Berechnung!H58","v":2},{"$f":"Berechnung!I58","v":2},{"$f":"Berechnung!K58","v":0},{"$f":"Berechnung!L58","v":0},{"$f":"Berechnung!M58","v":2},{"$f":"Berechnung!N58","v":2},null,{"$f":"T20","v":"Müller Marcus"}]
[0,{"$f":"IF(D21=\"\",\"\",Berechnung!B48)","v":3},{"$f":"Berechnung!C48","v":"E3"},{"$f":"IFERROR(VLOOKUP(C21,Spieler!$I$2:$J$41,2,FALSE),\"\")","v":"Delling Tino"},{"$f":"Berechnung!E48","v":2},{"$f":"Berechnung!F48","v":2},{"$f":"Berechnung!G48","v":0},{"$f":"Berechnung!J48","v":0},{"$f":"Berechnung!H48","v":4},{"$f":"Berechnung!I48","v":0},{"$f":"Berechnung!K48","v":0},{"$f":"Berechnung!L48","v":0},{"$f":"Berechnung!M48","v":24002},{"$f":"Berechnung!N48","v":1},null,{"$f":"D21","v":"Delling Tino"},null,{"$f":"IF(T21=\"\",\"\",Berechnung!B59)","v":3},{"$f":"Berechnung!C59","v":"F3"},{"$f":"IFERROR(VLOOKUP(S21,Spieler!$I$2:$J$41,2,FALSE),\"\")","v":"Rejke Ronny"},{"$f":"Berechnung!E59","v":2},{"$f":"Berechnung!F59","v":0},{"$f":"Berechnung!G59","v":2},{"$f":"Berechnung!J59","v":0},{"$f":"Berechnung!H59","v":1},{"$f":"Berechnung!I59","v":4},{"$f":"Berechnung!K59","v":0},{"$f":"Berechnung!L59","v":0},{"$f":"Berechnung!M59","v":-22998},{"$f":"Berechnung!N59","v":3},null,{"$f":"T21","v":"Rejke Ronny"}]
[1,{"$f":"IF(D22=\"\",\"\",Berechnung!B49)","v":""},{"$f":"Berechnung!C49","v":"E4"},{"$f":"IFERROR(VLOOKUP(C22,Spieler!$I$2:$J$41,2,FALSE),\"\")","v":""},{"$f":"Berechnung!E49","v":0},{"$f":"Berechnung!F49","v":0},{"$f":"Berechnung!G49","v":0},{"$f":"Berechnung!J49","v":0},{"$f":"Berechnung!H49","v":0},{"$f":"Berechnung!I49","v":0},{"$f":"Berechnung!K49","v":0},{"$f":"Berechnung!L49","v":0},{"$f":"Berechnung!M49","v":-200000},{"$f":"Berechnung!N49","v":""},null,{"$f":"D22","v":""},null,{"$f":"IF(T22=\"\",\"\",Berechnung!B60)","v":""},{"$f":"Berechnung!C60","v":"F4"},{"$f":"IFERROR(VLOOKUP(S22,Spieler!$I$2:$J$41,2,FALSE),\"\")","v":""},{"$f":"Berechnung!E60","v":0},{"$f":"Berechnung!F60","v":0},{"$f":"Berechnung!G60","v":0},{"$f":"Berechnung!J60","v":0},{"$f":"Berechnung!H60","v":0},{"$f":"Berechnung!I60","v":0},{"$f":"Berechnung!K60","v":0},{"$f":"Berechnung!L60","v":0},{"$f":"Berechnung!M60","v":-200000},{"$f":"Berechnung!N60","v":""},null,{"$f":"T22","v":""}]
[1,{"$f":"IF(D23=\"\",\"\",Berechnung!B50)","v":""},{"$f":"Berechnung!C50","v":"E5"},{"$f":"IFERROR(VLOOKUP(C23,Spieler!$I$2:$J$41,2,FALSE),\"\")","v":""},{"$f":"Berechnung!E50","v":0},{"$f":"Berechnung!F50","v":0},{"$f":"Berechnung!G50","v":0},{"$f":"Berechnung!J50","v":0},{"$f":"Berechnung!H50","v":0},{"$f":"Berechnung!I50","v":0},{"$f":"Berechnung!K50","v":0},{"$f":"Berechnung!L50","v":0},{"$f":"Berechnung!M50","v":-200000},{"$f":"Berechnung!N50","v":""},null,{"$f":"D23","v":""},null,{"$f":"IF(T23=\"\",\"\",Berechnung!B61)","v":""},{"$f":"Berechnung!C61","v":"F5"},{"$f":"IFERROR(VLOOKUP(S23,Spieler!$I$2:$J$41,2,FALSE),\"\")","v":""},{"$f":"Berechnung!E61","v":0},{"$f":"Berechnung!F61","v":0},{"$f":"Berechnung!G61","v":0},{"$f":"Berechnung!J61","v":0},{"$f":"Berechnung!H61","v":0},{"$f":"Berechnung!I61","v":0},{"$f":"Berechnung!K61","v":0},{"$f":"Berechnung!L61","v":0},{"$f":"Berechnung!M61","v":-200000},{"$f":"Berechnung!N61","v":""},null,{"$f":"T23","v":""}]
[]
[0,"GRUPPE G",null,null,null,null,null,null,null,null,null,null,null,null,null,null,null,"GRUPPE H"]
[0,{"$f":"IF(D27=\"\",0,1)","v":1},null,{"$f":"Berechnung!D67","v":"Spieler"},{"$f":"Berechnung!E67","v":"M"},{"$f":"Berechnung!F67","v":"W"},{"$f":"Berechnung!G67","v":"L"},"U","F+","F-",{"$f":"Berechnung!K67","v":0},{"$f":"Berechnung!L67","v":0},{"$f":"Berechnung!M67","v":"Rang"},{"$f":"Berechnung!N67","v":"Rang"},{"$f":"Berechnung!O67","v":"P+"},null,null,{"$f":"IF(T27=\"\",0,1)","v":1},null,{"$f":"Berechnung!D78","v":"Spieler"},{"$f":"Berechnung!E78","v":"M"},{"$f":"Berechnung!F78","v":"W"},{"$f":"Berechnung!G78","v":"L"},"U","F+","F-",{"$f":"Berechnung!K78","v":0},{"$f":"Berechnung!L78","v":0},{"$f":"Berechnung!M78","v":"Rang"},{"$f":"Berechnung!N78","v":"Rang"},{"$f":"Berechnung!O78","v":"P+"}]
[0,{"$f":"IF(D27=\"\",\"\",Berechnung!B68)","v":1},{"$f":"Berechnung!C68","v":"G1"},{"$f":"IFERROR(VLOOKUP(C27,Spieler!$I$2:$J$41,2,FALSE),\"\")","v":"Löffel Ulrich"},{"$f":"Berechnung!E68","v":2},{"$f":"Berechnung!F68","v":0},{"$f":"Berechnung!G68","v":2},{"$f":"Berechnung!J68","v":0},{"$f":"Berechnung!H68","v":0},{"$f":"Berechnung!I68","v":4},{"$f":"Berechnung!K68","v":0},{"$f":"Berechnung!L68","v":0},{"$f":"Berechnung!M68","v":-23998},{"$f":"Berechnung!N68","v":3},null,{"$f":"D27","v":"Löffel Ulrich"},{"$f":"IF(OR(T27=\"\",T27=0),9,0)","v":0},{"$f":"IF(T27=\"\",\"\",Berechnung!B79)","v":1},{"$f":"Berechnung!C79","v":"H1"},{"$f":"IFERROR(VLOOKUP(S27,Spieler!$I$2:$J$41,2,FALSE),\"\")","v":"Elham Faiz"},{"$f":"Berechnung!E79","v":2},{"$f":"Berechnung!F79","v":0},{"$f":"Berechnung!G79","v":2},{"$f":"Berechnung!J79","v":0},{"$f":"Berechnung!H79","v":1},{"$f":"Berechnung!I79","v":4},{"$f":"Berechnung!K79","v":0},{"$f":"Berechnung!L79","v":0},{"$f":"Berechnung!M79","v":-22998},{"$f":"Berechnung!N79","v":3},null,{"$f":"T27","v":"Elham Faiz"}]
[0,{"$f":"IF(D28=\"\",\"\",Berechnung!B69)","v":2},{"$f":"Berechnung!C69","v":"G2"},{"$f":"IFERROR(VLOOKUP(C28,Spieler!$I$2:$J$41,2,FALSE),\"\")","v":"Stachly Marec"},{"$f":"Berechnung!E69","v":2},{"$f":"Berechnung!F69","v":2},{"$f":"Berechnung!G69","v":0},{"$f":"Berechnung!J69","v":0},{"$f":"Berechnung!H69","v":4},{"$f":"Berechnung!I69","v":0},{"$f":"Berechnung!K69","v":0},{"$f":"Berechnung!L69","v":0},{"$f":"Berechnung!M69","v":24002},{"$f":"Berechnung!N69","v":1},null,{"$f":"D28","v":"Stachly Marec"},null,{"$f":"IF(T28=\"\",\"\",Berechnung!B80)","v":2},{"$f":"Berechnung!C80","v":"H2"},{"$f":"IFERROR(VLOOKUP(S28,Spieler!$I$2:$J$41,2,FALSE),\"\")","v":"Fandrei Joel"},{"$f":"Berechnung!E80","v":2},{"$f":"Berechnung!F80","v":2},{"$f":"Berechnung!G80","v":0},{"$f":"Berechnung!J80","v":0},{"$f":"Berechnung!H80","v":4},{"$f":"Berechnung!I80","v":1},{"$f":"Berechnung!K80","v":0},{"$f":"Berechnung!L80","v":0},{"$f":"Berechnung!M80","v":23002},{"$f":"Berechnung!N80","v":1},null,{"$f":"T28","v":"Fandrei Joel"}]
[0,{"$f":"IF(D29=\"\",\"\",Berechnung!B70)","v":3},{"$f":"Berechnung!C70","v":"G3"},{"$f":"IFERROR(VLOOKUP(C29,Spieler!$I$2:$J$41,2,FALSE),\"\")","v":"Hofmann Frank"},{"$f":"Berechnung!E70","v":2},{"$f":"Berechnung!F70","v":1},{"$f":"Berechnung!G70","v":1},{"$f":"Berechnung!J70","v":0},{"$f":"Berechnung!H70","v":2},{"$f":"Berechnung!I70","v":2},{"$f":"Berechnung!K70","v":0},{"$f":"Berechnung!L70","v":0},{"$f":"Berechnung!M70","v":2},{"$f":"Berechnung!N70","v":2},null,{"$f":"D29","v":"Hofmann Frank"},null,{"$f":"IF(T29=\"\",\"\",Berechnung!B81)","v":3},{"$f":"Berechnung!C81","v":"H3"},{"$f":"IFERROR(VLOOKUP(S29,Spieler!$I$2:$J$41,2,FALSE),\"\")","v":"Thomas Moritz"},{"$f":"Berechnung!E81","v":2},{"$f":"Berechnung!F81","v":1},{"$f":"Berechnung!G81","v":1},{"$f":"Berechnung!J81","v":0},{"$f":"Berechnung!H81","v":3},{"$f":"Berechnung!I81","v":3},{"$f":"Berechnung!K81","v":0},{"$f":"Berechnung!L81","v":0},{"$f":"Berechnung!M81","v":2},{"$f":"Berechnung!N81","v":2},null,{"$f":"T29","v":"Thomas Moritz"}]
[1,{"$f":"IF(D30=\"\",\"\",Berechnung!B71)","v":""},{"$f":"Berechnung!C71","v":"G4"},{"$f":"IFERROR(VLOOKUP(C30,Spieler!$I$2:$J$41,2,FALSE),\"\")","v":""},{"$f":"Berechnung!E71","v":0},{"$f":"Berechnung!F71","v":0},{"$f":"Berechnung!G71","v":0},{"$f":"Berechnung!J71","v":0},{"$f":"Berechnung!H71","v":0},{"$f":"Berechnung!I71","v":0},{"$f":"Berechnung!K29","v":0},{"$f":"Berechnung!L29","v":0},{"$f":"Berechnung!M71","v":-200000},{"$f":"Berechnung!N71","v":""},null,{"$f":"D30","v":""},null,{"$f":"IF(T30=\"\",\"\",Berechnung!B82)","v":""},{"$f":"Berechnung!C82","v":"H4"},{"$f":"IFERROR(VLOOKUP(S30,Spieler!$I$2:$J$41,2,FALSE),\"\")","v":""},{"$f":"Berechnung!E82","v":0},{"$f":"Berechnung!F82","v":0},{"$f":"Berechnung!G82","v":0},{"$f":"Berechnung!J82","v":0},{"$f":"Berechnung!H82","v":0},{"$f":"Berechnung!I82","v":0},{"$f":"Berechnung!K82","v":0},{"$f":"Berechnung!L82","v":0},{"$f":"Berechnung!M82","v":-200000},{"$f":"Berechnung!N82","v":""},null,{"$f":"T30","v":""}]
[1,{"$f":"IF(D31=\"\",\"\",Berechnung!B72)","v":""},{"$f":"Berechnung!C72","v":"G5"},{"$f":"IFERROR(VLOOKUP(C31,Spieler!$I$2:$J$41,2,FALSE),\"\")","v":""},{"$f":"Berechnung!E30","v":0},{"$f":"Berechnung!F30","v":0},{"$f":"Berechnung!G30","v":0},{"$f":"Berechnung!J72","v":0},{"$f":"Berechnung!H72","v":0},{"$f":"Berechnung!I72","v":0},{"$f":"Berechnung!K30","v":0},{"$f":"Berechnung!L30","v":0},{"$f":"Berechnung!M72","v":-200000},{"$f":"Berechnung!N72","v":""},null,{"$f":"D31","v":""},null,{"$f":"IF(T31=\"\",\"\",Berechnung!B83)","v":""},{"$f":"Berechnung!C83","v":"H5"},{"$f":"IFERROR(VLOOKUP(S31,Spieler!$I$2:$J$41,2,FALSE),\"\")","v":""},{"$f":"Berechnung!E83","v":0},{"$f":"Berechnung!F83","v":0},{"$f":"Berechnung!G83","v":0},{"$f":"Berechnung!J83","v":0},{"$f":"Berechnung!H83","v":0},{"$f":"Berechnung!I83","v":0},{"$f":"Berechnung!K83","v":0},{"$f":"Berechnung!L83","v":0},{"$f":"Berechnung!M83","v":-200000},{"$f":"Berechnung!N83","v":""},null,{"$f":"T31","v":""}]

{"sheet":"Matches","index":2,"n_rows":112,"n_cols":38,"rows_kept":112,"cut":false,"hidden":false,"merged":[[0,16,0,19],[0,10,0,13],[0,14,0,15],[7,36,7,37],[14,24,14,39],[13,24,13,40]]}
[{"$f":"E112","v":24},"Nr.","Gr.",null,"Startzeit","Endzeit","Dauer","Spieler",null,"Spieler","Break 30+",null,null,null,"Match",null,"Break 30+",null,null,null,null,null,"23:13:11","13:34:28","12:18:14",{"$f":"Y1+AA1","v":"13:13:14"},{"$f":"Spieler!AA14","v":"00:55:00"},"HB SP1",null,"Anzahl1","Anzahl2",null,"HB SP2"]
[{"$f":"Berechnung!AX2","v":0},{"$f":"Berechnung!BH2","v":1},{"$f":"Berechnung!BF2","v":"A"},{"$f":"Berechnung!BA2","v":0},"13:03:00","14:07:54",{"$f":"IF(F2=\"\",\"\",F2-E2)","v":"01:04:54"},{"$f":"Berechnung!Z2","v":"Valderrama Salvador"},{"$f":"IF(H2>\"\",\"v\",\"\")","v":"v"},{"$f":"Berechnung!AA2","v":"Brachmanski Dave"},null,null,null,null,2,0,null,null,null,null,null,null,null,null,null,{"$f":"IF(E2=\"\",\"\",IF(AND(E2>\"\",O2+P2>1),3,IF(O2+P2>=2,3,IF($Y$1>AA2,1,0))))","v":3},{"$f":"IF(E2=\"\",\"\",E2+$AA$1)","v":"13:58:00"},{"$f":"IFERROR(LARGE(K2:N2,1),\"\")","v":""},{"$f":"H2","v":"Valderrama Salvador"},{"$f":"IF(K2>0,1)+IF(L2>0,1)+IF(M2>0,1)+IF(N2>0,1)","v":0},{"$f":"IF(Q2>0,1)+IF(R2>0,1)+IF(S2>0,1)+IF(T2>0,1)","v":0},null,{"$f":"IFERROR(LARGE(Q2:T2,1),\"\")","v":""},{"$f":"J2","v":"Brachmanski Dave"}]
[{"$f":"Berechnung!AX3","v":0},{"$f":"Berechnung!BH3","v":2},{"$f":"Berechnung!BF3","v":"B"},{"$f":"Berechnung!BA3","v":0},"10:04:00","10:56:22",{"$f":"IF(F3=\"\",\"\",F3-E3)","v":"00:52:22"},{"$f":"Berechnung!Z3","v":"Drahn Robert"},{"$f":"IF(H3>\"\",\"v\",\"\")","v":"v"},{"$f":"Berechnung!AA3","v":"Brömel Frank"},null,null,null,null,2,0,null,null,null,null,null,null,null,null,null,3,"10:59:00","","Drahn Robert",0,{"$f":"IF(Q3>0,1)+IF(R3>0,1)+IF(S3>0,1)+IF(T3>0,1)","v":0},null,"","Brömel Frank"]
[{"$f":"Berechnung!AX4","v":0},{"$f":"Berechnung!BH4","v":3},{"$f":"Berechnung!BF4","v":"C"},{"$f":"Berechnung!BA4","v":0},"10:04:00","11:16:32",{"$f":"IF(F4=\"\",\"\",F4-E4)","v":"01:12:32"},{"$f":"Berechnung!Z4","v":"Behling Oliver"},"v",{"$f":"Berechnung!AA4","v":"Witzik Oliver"},null,null,null,null,0,2,null,null,null,null,null,null,null,null,null,3,"10:59:00","","Behling Oliver",0,0,null,"","Witzik Oliver"]
[{"$f":"Berechnung!AX5","v":0},{"$f":"Berechnung!BH5","v":4},{"$f":"Berechnung!BF5","v":"D"},{"$f":"Berechnung!BA5","v":0},"10:04:00","10:52:07","00:48:07",{"$f":"Berechnung!Z5","v":"Hartung Andreas"},"v",{"$f":"Berechnung!AA5","v":"Suttner Magnus"},null,null,null,null,0,2,null,null,null,null,null,null,null,null,null,3,"10:59:00","","Hartung Andreas",0,0,null,"","Suttner Magnus"]
[{"$f":"Berechnung!AX6","v":0},{"$f":"Berechnung!BH6","v":5},{"$f":"Berechnung!BF6","v":"E"},{"$f":"Berechnung!BA6","v":0},"10:04:00","10:54:00","00:50:00",{"$f":"Berechnung!Z6","v":"Swennen Andy"},"v",{"$f":"Berechnung!AA6","v":"Fandrei Andreas"},null,null,null,null,0,2,null,null,null,null,null,null,null,null,null,3,"10:59:00","","Swennen Andy",0,0,null,"","Fandrei Andreas"]
[{"$f":"Berechnung!AX7","v":0},{"$f":"Berechnung!BH7","v":6},{"$f":"Berechnung!BF7","v":"F"},{"$f":"Berechnung!BA7","v":0},"10:52:00","11:42:08","00:50:08",{"$f":"Berechnung!Z7","v":"Jeroch Paul"},"v",{"$f":"Berechnung!AA7","v":"Müller Marcus"},63,38,null,null,2,0,null,null,null,null,null,null,null,null,null,3,"11:47:00",63,"Jeroch Paul",2,0,null,"","Müller Marcus"]
[{"$f":"Berechnung!AX8","v":0},{"$f":"Berechnung!BH8","v":7},{"$f":"Berechnung!BF8","v":"G"},{"$f":"Berechnung!BA8","v":0},"10:54:00","11:57:27","01:03:27",{"$f":"Berechnung!Z8","v":"Löffel Ulrich"},"v",{"$f":"Berechnung!AA8","v":"Stachly Marec"},null,null,null,null,0,2,null,null,null,null,null,null,null,null,null,3,"11:49:00","","Löffel Ulrich",0,0,null,"","Stachly Marec",null,null,"speichert unter C:\\Users\\Public\\Videos"]
[{"$f":"Berechnung!AX9","v":0},{"$f":"Berechnung!BH9","v":8},{"$f":"Berechnung!BF9","v":"H"},{"$f":"Berechnung!BA9","v":0},"10:56:00","11:53:21","00:57:21",{"$f":"Berechnung!Z9","v":"Elham Faiz"},"v",{"$f":"Berechnung!AA9","v":"Fandrei Joel"},null,null,null,null,0,2,44,null,null,null,null,null,null,null,null,3,"11:51:00","","Elham Faiz",0,1,null,44,"Fandrei Joel",null,null,148,"Freigabe-Code Finals"]
[{"$f":"Berechnung!AX10","v":0},{"$f":"Berechnung!BH10","v":9},{"$f":"Berechnung!BF10","v":"A"},{"$f":"Berechnung!BA10","v":0},"14:49:00","15:50:36","01:01:36",{"$f":"Berechnung!Z10","v":"Valderrama Salvador"},"v",{"$f":"Berechnung!AA10","v":"Gärtner David"},null,null,null,null,1,2,32,null,null,null,null,null,null,null,null,3,"15:44:00","","Valderrama Salvador",0,1,null,32,"Gärtner David"]
[{"$f":"Berechnung!AX11","v":0},{"$f":"Berechnung!BH11","v":10},{"$f":"Berechnung!BF11","v":"B"},{"$f":"Berechnung!BA11","v":0},"11:53:00","12:32:25","00:39:25",{"$f":"Berechnung!Z11","v":"Drahn Robert"},"v",{"$f":"Berechnung!AA11","v":"Weber Marco"},null,null,null,null,0,2,53,null,null,null,null,null,null,null,null,3,"12:48:00","","Drahn Robert",0,1,null,53,"Weber Marco",null,null,"Die Vorrunde ist abgeschlossen?"]
[{"$f":"Berechnung!AX12","v":0},{"$f":"Berechnung!BH12","v":11},{"$f":"Berechnung!BF12","v":"C"},{"$f":"Berechnung!BA12","v":0},"11:55:00","13:20:44","01:25:44",{"$f":"Berechnung!Z12","v":"Behling Oliver"},"v",{"$f":"Berechnung!AA12","v":"Isermann Rene"},null,null,null,null,2,0,null,null,null,null,null,null,null,null,true,3,"12:50:00","","Behling Oliver",0,0,null,"","Isermann Rene",null,null,"Haken setzen!"]
[{"$f":"Berechnung!AX13","v":0},{"$f":"Berechnung!BH13","v":12},{"$f":"Berechnung!BF13","v":"D"},{"$f":"Berechnung!BA13","v":0},"12:00:00","13:03:45","01:03:45",{"$f":"Berechnung!Z13","v":"Hartung Andreas"},"v",{"$f":"Berechnung!AA13","v":"Straßburger Marko"},null,null,null,null,1,2,null,null,null,null,null,null,null,null,null,3,"12:55:00","","Hartung Andreas",0,0,null,"","Straßburger Marko",null,null,"Die Auslosung der Achtelfinals erfolgt!"]
[{"$f":"Berechnung!AX14","v":0},{"$f":"Berechnung!BH14","v":13},{"$f":"Berechnung!BF14","v":"E"},{"$f":"Berechnung!BA14","v":0},"12:27:00","13:13:56","00:46:56",{"$f":"Berechnung!Z14","v":"Swennen Andy"},"v",{"$f":"Berechnung!AA14","v":"Delling Tino"},null,null,null,null,0,2,null,null,null,null,null,null,null,null,"ACHTUNG!"]
[{"$f":"Berechnung!AX15","v":0},{"$f":"Berechnung!BH15","v":14},{"$f":"Berechnung!BF15","v":"F"},{"$f":"Berechnung!BA15","v":0},"12:43:00","13:59:05","01:16:05",{"$f":"Berechnung!Z15","v":"Jeroch Paul"},"v",{"$f":"Berechnung!AA15","v":"Rejke Ronny"},null,null,null,null,2,1,null,null,null,null,null,null,null,null,"Das Tabellenblatt wird deaktiviert!"]
[{"$f":"Berechnung!AX16","v":0},{"$f":"Berechnung!BH16","v":15},{"$f":"Berechnung!BF16","v":"G"},{"$f":"Berechnung!BA16","v":0},"13:15:00","14:24:32","01:09:32",{"$f":"Berechnung!Z16","v":"Löffel Ulrich"},"v",{"$f":"Berechnung!AA16","v":"Hofmann Frank"},null,null,null,null,0,2,null,null,null,null,null,null,null,null,null,3,"14:10:00","","Löffel Ulrich",0,0,null,"","Hofmann Frank"]
[{"$f":"Berechnung!AX17","v":0},{"$f":"Berechnung!BH17","v":16},{"$f":"Berechnung!BF17","v":"H"},{"$f":"Berechnung!BA17","v":0},"13:20:00","14:40:13","01:20:13",{"$f":"Berechnung!Z17","v":"Elham Faiz"},"v",{"$f":"Berechnung!AA17","v":"Thomas Moritz"},32,null,null,null,1,2,null,null,null,null,null,null,null,null,null,3,"14:15:00",32,"Elham Faiz",1,0,null,"","Thomas Moritz"]
[{"$f":"Berechnung!AX18","v":0},{"$f":"Berechnung!BH18","v":17},{"$f":"Berechnung!BF18","v":"A"},{"$f":"Berechnung!BA18","v":0},"11:22:00","12:23:10","01:01:10",{"$f":"Berechnung!Z18","v":"Brachmanski Dave"},"v",{"$f":"Berechnung!AA18","v":"Gärtner David"},null,null,null,null,1,2,null,null,null,null,null,null,null,null,null,3,"12:17:00","","Brachmanski Dave",0,0,null,"","Gärtner David"]
[{"$f":"Berechnung!AX19","v":0},{"$f":"Berechnung!BH19","v":18},{"$f":"Berechnung!BF19","v":"B"},{"$f":"Berechnung!BA19","v":0},"14:06:00","14:43:59","00:37:59",{"$f":"Berechnung!Z19","v":"Brömel Frank"},"v",{"$f":"Berechnung!AA19","v":"Weber Marco"},null,null,null,null,0,2,null,null,null,null,null,null,null,null,null,3,"15:01:00","","Brömel Frank",0,0,null,"","Weber Marco"]
[{"$f":"Berechnung!AX20","v":0},{"$f":"Berechnung!BH20","v":19},{"$f":"Berechnung!BF20","v":"C"},{"$f":"Berechnung!BA20","v":0},"14:19:00","15:07:02","00:48:02",{"$f":"Berechnung!Z20","v":"Witzik Oliver"},"v",{"$f":"Berechnung!AA20","v":"Isermann Rene"},null,null,null,null,2,0,null,null,null,null,null,null,null,null,null,3,"15:14:00","","Witzik Oliver",0,0,null,"","Isermann Rene"]
[{"$f":"Berechnung!AX21","v":0},{"$f":"Berechnung!BH21","v":20},{"$f":"Berechnung!BF21","v":"D"},{"$f":"Berechnung!BA21","v":0},"14:35:00","16:00:38","01:25:38",{"$f":"Berechnung!Z21","v":"Suttner Magnus"},"v",{"$f":"Berechnung!AA21","v":"Straßburger Marko"},null,null,null,null,1,2,null,null,null,null,null,null,null,null,null,3,"15:30:00","","Suttner Magnus",0,0,null,"","Straßburger Marko"]
[{"$f":"Berechnung!AX22","v":0},{"$f":"Berechnung!BH22","v":21},{"$f":"Berechnung!BF22","v":"E"},{"$f":"Berechnung!BA22","v":0},"14:45:00","15:35:39","00:50:39",{"$f":"Berechnung!Z22","v":"Fandrei Andreas"},"v",{"$f":"Berechnung!AA22","v":"Delling Tino"},null,null,null,null,0,2,null,null,null,null,null,null,null,null,null,3,"15:40:00","","Fandrei Andreas",0,0,null,"","Delling Tino"]
[{"$f":"Berechnung!AX23","v":0},{"$f":"Berechnung!BH23","v":22},{"$f":"Berechnung!BF23","v":"F"},{"$f":"Berechnung!BA23","v":0},"15:13:00","16:15:48","01:02:48",{"$f":"Berechnung!Z23","v":"Müller Marcus"},"v",{"$f":"Berechnung!AA23","v":"Rejke Ronny"},null,null,null,null,2,0,null,null,null,null,null,null,null,null,null,3,"16:08:00","","Müller Marcus",0,0,null,"","Rejke Ronny"]
[{"$f":"Berechnung!AX24","v":0},{"$f":"Berechnung!BH24","v":23},{"$f":"Berechnung!BF24","v":"G"},{"$f":"Berechnung!BA24","v":0},"15:35:00","16:10:56","00:35:56",{"$f":"Berechnung!Z24","v":"Stachly Marec"},"v",{"$f":"Berechnung!AA24","v":"Hofmann Frank"},30,null,null,null,2,0,null,null,null,null,null,null,null,null,null,3,"16:30:00",30,"Stachly Marec",1,0,null,"","Hofmann Frank"]
[{"$f":"Berechnung!AX25","v":0},{"$f":"Berechnung!BH25","v":24},{"$f":"Berechnung!BF25","v":"H"},{"$f":"Berechnung!BA25","v":0},"15:55:00","16:45:20","00:50:20",{"$f":"Berechnung!Z25","v":"Fandrei Joel"},"v",{"$f":"Berechnung!AA25","v":"Thomas Moritz"},null,null,null,null,2,1,null,null,null,null,null,null,null,null,null,3,"16:50:00","","Fandrei Joel",0,0,null,"","Thomas Moritz"]
[{"$f":"Berechnung!AX26","v":0},{"$f":"Berechnung!BH26","v":""},{"$f":"Berechnung!BF26","v":""},{"$f":"Berechnung!BA26","v":0},null,null,"",{"$f":"Berechnung!Z26","v":""},"",{"$f":"Berechnung!AA26","v":""},null,null,null,null,null,null,null,null,null,null,null,null,null,null,null,"","","","",0,0,null,"",""]
[{"$f":"Berechnung!AX27","v":0},{"$f":"Berechnung!BH27","v":""},{"$f":"Berechnung!BF27","v":""},{"$f":"Berechnung!BA27","v":0},null,null,"",{"$f":"Berechnung!Z27","v":""},"",{"$f":"Berechnung!AA27","v":""},null,null,null,null,null,null,null,null,null,null,null,null,null,null,null,"","","","",0,0,null,"",""]
[{"$f":"Berechnung!AX28","v":0},{"$f":"Berechnung!BH28","v":""},{"$f":"Berechnung!BF28","v":""},{"$f":"Berechnung!BA28","v":0},null,null,"",{"$f":"Berechnung!Z28","v":""},"",{"$f":"Berechnung!AA28","v":""},null,null,null,null,null,null,null,null,null,null,null,null,null,null,null,"","","","",0,0,null,"",""]
[{"$f":"Berechnung!AX29","v":0},{"$f":"Berechnung!BH29","v":""},{"$f":"Berechnung!BF29","v":""},{"$f":"Berechnung!BA29","v":0},null,null,"",{"$f":"Berechnung!Z29","v":""},"",{"$f":"Berechnung!AA29","v":""},null,null,null,null,null,null,null,null,null,null,null,null,null,null,null,"","","","",0,0,null,"",""]
[{"$f":"Berechnung!AX30","v":0},{"$f":"Berechnung!BH30","v":""},{"$f":"Berechnung!BF30","v":""},{"$f":"Berechnung!BA30","v":0},null,null,"",{"$f":"Berechnung!Z30","v":""},"",{"$f":"Berechnung!AA30","v":""},null,null,null,null,null,null,null,null,null,null,null,null,null,null,null,"","","","",0,0,null,"",""]
[{"$f":"Berechnung!AX31","v":0},{"$f":"Berechnung!BH31","v":""},{"$f":"Berechnung!BF31","v":""},{"$f":"Berechnung!BA31","v":0},null,null,"",{"$f":"Berechnung!Z31","v":""},"",{"$f":"Berechnung!AA31","v":""},null,null,null,null,null,null,null,null,null,null,null,null,null,null,null,"","","","",0,0,null,"",""]
[{"$f":"Berechnung!AX32","v":0},{"$f":"Berechnung!BH32","v":""},{"$f":"Berechnung!BF32","v":""},{"$f":"Berechnung!BA32","v":0},null,null,"",{"$f":"Berechnung!Z32","v":""},"",{"$f":"Berechnung!AA32","v":""},null,null,null,null,null,null,null,null,null,null,null,null,null,null,null,"","","","",0,0,null,"",""]
[{"$f":"Berechnung!AX33","v":0},{"$f":"Berechnung!BH33","v":""},{"$f":"Berechnung!BF33","v":""},{"$f":"Berechnung!BA33","v":0},null,null,"",{"$f":"Berechnung!Z33","v":""},"",{"$f":"Berechnung!AA33","v":""},null,null,null,null,null,null,null,null,null,null,null,null,null,null,null,"","","","",0,0,null,"",""]
[{"$f":"Berechnung!AX34","v":0},{"$f":"Berechnung!BH34","v":""},{"$f":"Berechnung!BF34","v":""},{"$f":"Berechnung!BA34","v":0},null,null,"",{"$f":"Berechnung!Z34","v":""},"",{"$f":"Berechnung!AA34","v":""},null,null,null,null,null,null,null,null,null,null,null,null,null,null,null,{"$f":"IF(E34=\"\",\"\",IF(AND(E34>\"\",O34+P34>1),3,IF(O34+P34>=2,3,IF($Y$1>AA34,1,0))))","v":""},{"$f":"IF(E34=\"\",\"\",E34+$AA$1)","v":""},{"$f":"IFERROR(LARGE(K34:N34,1),\"\")","v":""},{"$f":"H34","v":""},{"$f":"IF(K34>0,1)+IF(L34>0,1)+IF(M34>0,1)+IF(N34>0,1)","v":0},0,null,{"$f":"IFERROR(LARGE(Q34:T34,1),\"\")","v":""},{"$f":"J34","v":""}]
[{"$f":"Berechnung!AX35","v":0},{"$f":"Berechnung!BH35","v":""},{"$f":"Berechnung!BF35","v":""},{"$f":"Berechnung!BA35","v":0},null,null,"",{"$f":"Berechnung!Z35","v":""},"",{"$f":"Berechnung!AA35","v":""},null,null,null,null,null,null,null,null,null,null,null,null,null,null,null,"","","","",0,0,null,"",""]
[{"$f":"Berechnung!AX36","v":0},{"$f":"Berechnung!BH36","v":""},{"$f":"Berechnung!BF36","v":""},{"$f":"Berechnung!BA36","v":0},null,null,"",{"$f":"Berechnung!Z36","v":""},"",{"$f":"Berechnung!AA36","v":""},null,null,null,null,null,null,null,null,null,null,null,null,null,null,null,"","","","",0,0,null,"",""]
[{"$f":"Berechnung!AX37","v":0},{"$f":"Berechnung!BH37","v":""},{"$f":"Berechnung!BF37","v":""},{"$f":"Berechnung!BA37","v":0},null,null,"",{"$f":"Berechnung!Z37","v":""},"",{"$f":"Berechnung!AA37","v":""},null,null,null,null,null,null,null,null,null,null,null,null,null,null,null,"","","","",0,0,null,"",""]
[{"$f":"Berechnung!AX38","v":0},{"$f":"Berechnung!BH38","v":""},{"$f":"Berechnung!BF38","v":""},{"$f":"Berechnung!BA38","v":0},null,null,"",{"$f":"Berechnung!Z38","v":""},"",null,null,null,null,null,null,null,null,null,null,null,null,null,null,null,null,"","","","",0,0,null,"",0]
[{"$f":"Berechnung!AX39","v":0},{"$f":"Berechnung!BH39","v":""},{"$f":"Berechnung!BF39","v":""},{"$f":"Berechnung!BA39","v":0},null,null,"",{"$f":"Berechnung!Z39","v":""},"",null,null,null,null,null,null,null,null,null,null,null,null,null,null,null,null,"","","","",0,0,null,"",0]
[{"$f":"Berechnung!AX40","v":0},{"$f":"Berechnung!BH40","v":""},{"$f":"Berechnung!BF40","v":""},{"$f":"Berechnung!BA40","v":0},null,null,"",{"$f":"Berechnung!Z40","v":""},"",null,null,null,null,null,null,null,null,null,null,null,null,null,null,null,null,"","","","",0,0,null,"",0]
[{"$f":"Berechnung!AX41","v":0},{"$f":"Berechnung!BH41","v":""},{"$f":"Berechnung!BF41","v":""},{"$f":"Berechnung!BA41","v":0},null,null,"",{"$f":"Berechnung!Z41","v":""},"",null,null,null,null,null,null,null,null,null,null,null,null,null,null,null,null,"","","","",0,0,null,"",0]
[{"$f":"Berechnung!AX42","v":0},{"$f":"Berechnung!BH42","v":""},{"$f":"Berechnung!BF42","v":""},{"$f":"Berechnung!BA42","v":0},null,null,"",{"$f":"Berechnung!Z42","v":""},"",null,null,null,null,null,null,null,null,null,null,null,null,null,null,null,null,"","","","",0,0,null,"",0]
[{"$f":"Berechnung!AX43","v":0},{"$f":"Berechnung!BH43","v":""},{"$f":"Berechnung!BF43","v":""},{"$f":"Berechnung!BA43","v":0},null,null,"",{"$f":"Berechnung!Z43","v":""},"",null,null,null,null,null,null,null,null,null,null,null,null,null,null,null,null,"","","","",0,0,null,"",0]
[{"$f":"Berechnung!AX44","v":0},{"$f":"Berechnung!BH44","v":""},{"$f":"Berechnung!BF44","v":""},{"$f":"Berechnung!BA44","v":0},null,null,"",{"$f":"Berechnung!Z44","v":""},"",null,null,null,null,null,null,null,null,null,null,null,null,null,null,null,null,"","","","",0,0,null,"",0]
[{"$f":"Berechnung!AX45","v":0},{"$f":"Berechnung!BH45","v":""},{"$f":"Berechnung!BF45","v":""},{"$f":"Berechnung!BA45","v":0},null,null,"",{"$f":"Berechnung!Z45","v":""},"",null,null,null,null,null,null,null,null,null,null,null,null,null,null,null,null,"","","","",0,0,null,"",0]
[{"$f":"Berechnung!AX46","v":0},{"$f":"Berechnung!BH46","v":""},{"$f":"Berechnung!BF46","v":""},{"$f":"Berechnung!BA46","v":0},null,null,"",{"$f":"Berechnung!Z46","v":""},"",{"$f":"Berechnung!AA46","v":""},null,null,null,null,null,null,null,null,null,null,null,null,null,null,null,"","","","",0,0,null,"",""]
[{"$f":"Berechnung!AX47","v":0},{"$f":"Berechnung!BH47","v":""},{"$f":"Berechnung!BF47","v":""},{"$f":"Berechnung!BA47","v":0},null,null,"",{"$f":"Berechnung!Z47","v":""},"",{"$f":"Berechnung!AA47","v":""},null,null,null,null,null,null,null,null,null,null,null,null,null,null,null,"","","","",0,0,null,"",""]
[{"$f":"Berechnung!AX48","v":0},{"$f":"Berechnung!BH48","v":""},{"$f":"Berechnung!BF48","v":""},{"$f":"Berechnung!BA48","v":0},null,null,"",{"$f":"Berechnung!Z48","v":""},"",{"$f":"Berechnung!AA48","v":""},null,null,null,null,null,null,null,null,null,null,null,null,null,null,null,"","","","",0,0,null,"",""]
[{"$f":"Berechnung!AX49","v":0},{"$f":"Berechnung!BH49","v":""},{"$f":"Berechnung!BF49","v":""},{"$f":"Berechnung!BA49","v":0},null,null,"",{"$f":"Berechnung!Z49","v":""},"",{"$f":"Berechnung!AA49","v":""},null,null,null,null,null,null,null,null,null,null,null,null,null,null,null,"","","","",0,0,null,"",""]
[{"$f":"Berechnung!AX50","v":0},{"$f":"Berechnung!BH50","v":""},{"$f":"Berechnung!BF50","v":""},{"$f":"Berechnung!BA50","v":0},null,null,"",{"$f":"Berechnung!Z50","v":""},"",{"$f":"Berechnung!AA50","v":""},null,null,null,null,null,null,null,null,null,null,null,null,null,null,null,"","","","",0,0,null,"",""]
[{"$f":"Berechnung!AX51","v":0},{"$f":"Berechnung!BH51","v":""},{"$f":"Berechnung!BF51","v":""},{"$f":"Berechnung!BA51","v":0},null,null,"",{"$f":"Berechnung!Z51","v":""},"",{"$f":"Berechnung!AA51","v":""},null,null,null,null,null,null,null,null,null,null,null,null,null,null,null,"","","","",0,0,null,"",""]
[{"$f":"Berechnung!AX52","v":0},{"$f":"Berechnung!BH52","v":""},{"$f":"Berechnung!BF52","v":""},{"$f":"Berechnung!BA52","v":0},null,null,"",{"$f":"Berechnung!Z52","v":""},"",{"$f":"Berechnung!AA52","v":""},null,null,null,null,null,null,null,null,null,null,null,null,null,null,null,"","","","",0,0,null,"",""]
[{"$f":"Berechnung!AX53","v":0},{"$f":"Berechnung!BH53","v":""},{"$f":"Berechnung!BF53","v":""},{"$f":"Berechnung!BA53","v":0},null,null,"",{"$f":"Berechnung!Z53","v":""},"",{"$f":"Berechnung!AA53","v":""},null,null,null,null,null,null,null,null,null,null,null,null,null,null,null,"","","","",0,0,null,"",""]
[{"$f":"Berechnung!AX54","v":0},{"$f":"Berechnung!BH54","v":""},{"$f":"Berechnung!BF54","v":""},{"$f":"Berechnung!BA54","v":0},null,null,"",{"$f":"Berechnung!Z54","v":""},"",{"$f":"Berechnung!AA54","v":""},null,null,null,null,null,null,null,null,null,null,null,null,null,null,null,"","","","",0,0,null,"",""]
[{"$f":"Berechnung!AX55","v":0},{"$f":"Berechnung!BH55","v":""},{"$f":"Berechnung!BF55","v":""},{"$f":"Berechnung!BA55","v":0},null,null,"",{"$f":"Berechnung!Z55","v":""},"",{"$f":"Berechnung!AA55","v":""},null,null,null,null,null,null,null,null,null,null,null,null,null,null,null,"","","","",0,0,null,"",""]
[{"$f":"Berechnung!AX56","v":0},{"$f":"Berechnung!BH56","v":""},{"$f":"Berechnung!BF56","v":""},{"$f":"Berechnung!BA56","v":0},null,null,"",{"$f":"Berechnung!Z56","v":""},"",{"$f":"Berechnung!AA56","v":""},null,null,null,null,null,null,null,null,null,null,null,null,null,null,null,"","","","",0,0,null,"",""]
[{"$f":"Berechnung!AX57","v":0},{"$f":"Berechnung!BH57","v":""},{"$f":"Berechnung!BF57","v":""},{"$f":"Berechnung!BA57","v":0},null,null,"",{"$f":"Berechnung!Z57","v":""},"",{"$f":"Berechnung!AA57","v":""},null,null,null,null,null,null,null,null,null,null,null,null,null,null,null,"","","","",0,0,null,"",""]
[{"$f":"Berechnung!AX58","v":0},{"$f":"Berechnung!BH58","v":""},{"$f":"Berechnung!BF58","v":""},{"$f":"Berechnung!BA58","v":0},null,null,"",{"$f":"Berechnung!Z58","v":""},"",{"$f":"Berechnung!AA58","v":""},null,null,null,null,null,null,null,null,null,null,null,null,null,null,null,"","","","",0,0,null,"",""]
[{"$f":"Berechnung!AX59","v":0},{"$f":"Berechnung!BH59","v":""},{"$f":"Berechnung!BF59","v":""},{"$f":"Berechnung!BA59","v":0},null,null,"",{"$f":"Berechnung!Z59","v":""},"",{"$f":"Berechnung!AA59","v":""},null,null,null,null,null,null,null,null,null,null,null,null,null,null,null,"","","","",0,0,null,"",""]
[{"$f":"Berechnung!AX60","v":0},{"$f":"Berechnung!BH60","v":""},{"$f":"Berechnung!BF60","v":""},{"$f":"Berechnung!BA60","v":0},null,null,"",{"$f":"Berechnung!Z60","v":""},"",{"$f":"Berechnung!AA60","v":""},null,null,null,null,null,null,null,null,null,null,null,null,null,null,null,"","","","",0,0,null,"",""]
[{"$f":"Berechnung!AX61","v":0},{"$f":"Berechnung!BH61","v":""},{"$f":"Berechnung!BF61","v":""},{"$f":"Berechnung!BA61","v":0},null,null,"",{"$f":"Berechnung!Z61","v":""},"",{"$f":"Berechnung!AA61","v":""},null,null,null,null,null,null,null,null,null,null,null,null,null,null,null,"","","","",0,0,null,"",""]
[{"$f":"Berechnung!AX62","v":0},{"$f":"Berechnung!BH62","v":""},{"$f":"Berechnung!BF62","v":""},{"$f":"Berechnung!BA62","v":0},null,null,"",{"$f":"Berechnung!Z62","v":""},"",{"$f":"Berechnung!AA62","v":""},null,null,null,null,null,null,null,null,null,null,null,null,null,null,null,"","","","",0,0,null,"",""]
[{"$f":"Berechnung!AX63","v":0},{"$f":"Berechnung!BH63","v":""},{"$f":"Berechnung!BF63","v":""},{"$f":"Berechnung!BA63","v":0},null,null,"",{"$f":"Berechnung!Z63","v":""},"",{"$f":"Berechnung!AA63","v":""},null,null,null,null,null,null,null,null,null,null,null,null,null,null,null,"","","","",0,0,null,"",""]
[{"$f":"Berechnung!AX64","v":0},{"$f":"Berechnung!BH64","v":""},{"$f":"Berechnung!BF64","v":""},{"$f":"Berechnung!BA64","v":0},null,null,"",{"$f":"Berechnung!Z64","v":""},"",{"$f":"Berechnung!AA64","v":""},null,null,null,null,null,null,null,null,null,null,null,null,null,null,null,"","","","",0,0,null,"",""]
[{"$f":"Berechnung!AX65","v":0},{"$f":"Berechnung!BH65","v":""},{"$f":"Berechnung!BF65","v":""},{"$f":"Berechnung!BA65","v":0},null,null,"",{"$f":"Berechnung!Z65","v":""},"",{"$f":"Berechnung!AA65","v":""},null,null,null,null,null,null,null,null,null,null,null,null,null,null,null,"","","","",0,0,null,"",""]
[{"$f":"Berechnung!AX66","v":0},{"$f":"Berechnung!BH66","v":""},{"$f":"Berechnung!BF66","v":""},{"$f":"Berechnung!BA66","v":0},null,null,"",{"$f":"Berechnung!Z66","v":""},"",{"$f":"Berechnung!AA66","v":""},null,null,null,null,null,null,null,null,null,null,null,null,null,null,null,{"$f":"IF(E66=\"\",\"\",IF(AND(E66>\"\",O66+P66>1),3,IF(O66+P66>=2,3,IF($Y$1>AA66,1,0))))","v":""},{"$f":"IF(E66=\"\",\"\",E66+$AA$1)","v":""},{"$f":"IFERROR(LARGE(K66:N66,1),\"\")","v":""},{"$f":"H66","v":""},{"$f":"IF(K66>0,1)+IF(L66>0,1)+IF(M66>0,1)+IF(N66>0,1)","v":0},0,null,{"$f":"IFERROR(LARGE(Q66:T66,1),\"\")","v":""},{"$f":"J66","v":""}]
[{"$f":"Berechnung!AX67","v":0},{"$f":"Berechnung!BH67","v":""},{"$f":"Berechnung!BF67","v":""},{"$f":"Berechnung!BA67","v":0},null,null,{"$f":"IF(F67=\"\",\"\",F67-E67)","v":""},{"$f":"Berechnung!Z67","v":""},{"$f":"IF(H67>\"\",\"v\",\"\")","v":""},{"$f":"Berechnung!AA67","v":""},null,null,null,null,null,null,null,null,null,null,null,null,null,null,null,"","","","",0,{"$f":"IF(Q67>0,1)+IF(R67>0,1)+IF(S67>0,1)+IF(T67>0,1)","v":0},null,"",""]
[{"$f":"Berechnung!AX68","v":0},{"$f":"Berechnung!BH68","v":""},{"$f":"Berechnung!BF68","v":""},{"$f":"Berechnung!BA68","v":0},null,null,"",{"$f":"Berechnung!Z68","v":""},"",{"$f":"Berechnung!AA68","v":""},null,null,null,null,null,null,null,null,null,null,null,null,null,null,null,"","","","",0,0,null,"",""]
[{"$f":"Berechnung!AX69","v":0},{"$f":"Berechnung!BH69","v":""},{"$f":"Berechnung!BF69","v":""},{"$f":"Berechnung!BA69","v":0},null,null,"",{"$f":"Berechnung!Z69","v":""},"",{"$f":"Berechnung!AA69","v":""},null,null,null,null,null,null,null,null,null,null,null,null,null,null,null,"","","","",0,0,null,"",""]
[{"$f":"Berechnung!AX70","v":0},{"$f":"Berechnung!BH70","v":""},{"$f":"Berechnung!BF70","v":""},{"$f":"Berechnung!BA70","v":0},null,null,"",{"$f":"Berechnung!Z70","v":""},"",{"$f":"Berechnung!AA70","v":""},null,null,null,null,null,null,null,null,null,null,null,null,null,null,null,"","","","",0,0,null,"",""]
[{"$f":"Berechnung!AX71","v":0},{"$f":"Berechnung!BH71","v":""},{"$f":"Berechnung!BF71","v":""},{"$f":"Berechnung!BA71","v":0},null,null,"",{"$f":"Berechnung!Z71","v":""},"",{"$f":"Berechnung!AA71","v":""},null,null,null,null,null,null,null,null,null,null,null,null,null,null,null,"","","","",0,0,null,"",""]
[{"$f":"Berechnung!AX72","v":0},{"$f":"Berechnung!BH72","v":""},{"$f":"Berechnung!BF72","v":""},{"$f":"Berechnung!BA72","v":0},null,null,"",{"$f":"Berechnung!Z72","v":""},"",{"$f":"Berechnung!AA72","v":""},null,null,null,null,null,null,null,null,null,null,null,null,null,null,null,"","","","",0,0,null,"",""]
[{"$f":"Berechnung!AX73","v":0},{"$f":"Berechnung!BH73","v":""},{"$f":"Berechnung!BF73","v":""},{"$f":"Berechnung!BA73","v":0},null,null,"",{"$f":"Berechnung!Z73","v":""},{"$f":"IF(H73>\"\",\"v\",\"\")","v":""},{"$f":"Berechnung!AA73","v":""},null,null,null,null,null,null,null,null,null,null,null,null,null,null,null,"","","","",0,0,null,"",""]
[{"$f":"Berechnung!AX74","v":0},{"$f":"Berechnung!BH74","v":""},{"$f":"Berechnung!BF74","v":""},{"$f":"Berechnung!BA74","v":0},null,null,"",{"$f":"Berechnung!Z74","v":""},"",{"$f":"Berechnung!AA74","v":""},null,null,null,null,null,null,null,null,null,null,null,null,null,null,null,"","","","",0,0,null,"",""]
[{"$f":"Berechnung!AX75","v":0},{"$f":"Berechnung!BH75","v":""},{"$f":"Berechnung!BF75","v":""},{"$f":"Berechnung!BA75","v":0},null,null,"",{"$f":"Berechnung!Z75","v":""},"",{"$f":"Berechnung!AA75","v":""},null,null,null,null,null,null,null,null,null,null,null,null,null,null,null,"","","","",0,0,null,"",""]
[{"$f":"Berechnung!AX76","v":0},{"$f":"Berechnung!BH76","v":""},{"$f":"Berechnung!BF76","v":""},{"$f":"Berechnung!BA76","v":0},null,null,"",{"$f":"Berechnung!Z76","v":""},"",{"$f":"Berechnung!AA76","v":""},null,null,null,null,null,null,null,null,null,null,null,null,null,null,null,"","","","",0,0,null,"",""]
[{"$f":"Berechnung!AX77","v":0},{"$f":"Berechnung!BH77","v":""},{"$f":"Berechnung!BF77","v":""},{"$f":"Berechnung!BA77","v":0},null,null,"",{"$f":"Berechnung!Z77","v":""},"",{"$f":"Berechnung!AA77","v":""},null,null,null,null,null,null,null,null,null,null,null,null,null,null,null,"","","","",0,0,null,"",""]
[{"$f":"Berechnung!AX78","v":0},{"$f":"Berechnung!BH78","v":""},{"$f":"Berechnung!BF78","v":""},{"$f":"Berechnung!BA78","v":0},null,null,"",{"$f":"Berechnung!Z78","v":""},"",{"$f":"Berechnung!AA78","v":""},null,null,null,null,null,null,null,null,null,null,null,null,null,null,null,"","","","",0,0,null,"",""]
[{"$f":"Berechnung!AX79","v":0},{"$f":"Berechnung!BH79","v":""},{"$f":"Berechnung!BF79","v":""},{"$f":"Berechnung!BA79","v":0},null,null,"",{"$f":"Berechnung!Z79","v":""},"",{"$f":"Berechnung!AA79","v":""},null,null,null,null,null,null,null,null,null,null,null,null,null,null,null,"","","","",0,0,null,"",""]
[{"$f":"Berechnung!AX80","v":0},{"$f":"Berechnung!BH80","v":""},{"$f":"Berechnung!BF80","v":""},{"$f":"Berechnung!BA80","v":0},null,null,"",{"$f":"Berechnung!Z80","v":""},"",{"$f":"Berechnung!AA80","v":""},null,null,null,null,null,null,null,null,null,null,null,null,null,null,null,"","","","",0,0,null,"",""]
[{"$f":"Berechnung!AX81","v":0},{"$f":"Berechnung!BH81","v":""},{"$f":"Berechnung!BF81","v":""},{"$f":"Berechnung!BA81","v":0},null,null,"",{"$f":"Berechnung!Z81","v":""},"",{"$f":"Berechnung!AA81","v":""},null,null,null,null,null,null,null,null,null,null,null,null,null,null,null,"","","","",0,0,null,"",""]
[null,null,null,null,null,null,null,null,null,null,null,null,null,null,null,null,null,null,null,null,null,null,null,null,null,null,null,{"$f":"IFERROR(LARGE(AB2:AB81,1),0)","v":63},null,{"$f":"SUM(AD2:AD81)","v":4},{"$f":"SUM(AE2:AE81)","v":3},null,{"$f":"IFERROR(LARGE(AG2:AG81,1),0)","v":53}]
[null,null,null,null,null,null,null,null,null,null,null,null,null,null,{"$f":"SUM(O2:P81)","v":55},null,null,null,null,null,null,null,null,null,null,null,null,{"$f":"IF(AB82=\"\",\"\",VLOOKUP(AB82,AB2:$AC$81,2,FALSE))","v":"Jeroch Paul"},null,null,null,null,{"$f":"IFERROR(IF(AG82=\"\",\"\",VLOOKUP(AG82,$AG$2:$AH$81,2,FALSE)),\"\")","v":"Weber Marco"}]
[null,null,null,null,null,null,null,null,null,null,null,null,null,null,null,null,null,null,null,null,null,null,null,null,null,null,null,{"$f":"IF(AB82>AG82,AB83,AG83)","v":"Jeroch Paul"}]
[null,null,null,null,null,null,null,null,null,null,null,null,null,null,null,null,null,null,null,null,null,null,null,null,null,null,null,{"$f":"IF(AND(AB82=0,AG82=0),\"\",IF(AB82>AG82,AB82,AG82))","v":63}]
[]
[]
[]
[]
[]
[]
[]
[]
[]
[]
[]
[]
[]
[]
[]
[]
[]
[]
[]
[]
[]
[]
[]
[]
[]
[]
[null,null,null,null,{"$f":"COUNTA(E2:E99)","v":24}]

{"sheet":"Berechnung","index":3,"n_rows":209,"n_cols":118,"rows_kept":209,"cut":false,"hidden":true,"merged":[[0,109,0,110],[0,111,0,112],[0,0,5,0],[77,0,82,0],[66,0,71,0],[11,0,16,0],[22,0,27,0],[33,0,38,0],[44,0,49,0],[55,0,60,0],[167,18,167,19],[167,20,167,21],[167,4,167,5],[167,6,167,7],[167,8,167,9],[167,13,167,14],[167,16,167,17]]}
["A",null,null,"Spieler","M","W","L","F+","F-","U",null,null,"Rang","Rang","P+",null,null,null,null,null,null,null,null,null,null,null,null,null,null,null,null,"F","F","W","L","M","U",null,null,null,null,null,null,null,null,null,null,null,null,null,null,null,null,null,null,null,null,null,null,{"$f":"Spieler!S12","v":24},{"$f":"AW1","v":0},8,9,10,11,12,13,14,15,16,17,18,19,20,21,22,23,24,25,26,27,28,29,30,31,32,33,34,35,36,37,38,39,40,{"$f":"BH1","v":24},null,null,{"$f":"Spieler!I1","v":0},null,null,null,null,null,null,null,null,null,null,null,"Gesetzte Spieler",null,"nicht gesetzte Sp"]
[null,1,"A1",{"$f":"'1. Runde Gruppen'!D3","v":"Valderrama Salvador"},{"$f":"AJ2+AJ5+AJ8+AJ4","v":2},{"$f":"AH2+AH5+AH8+AH4","v":1},{"$f":"AI2+AI5+AI8+AI4","v":1},{"$f":"AF2+AF5+AF8+AF4","v":3},{"$f":"AG2+AG5+AG8+AG4","v":2},{"$f":"AK2+AK5+AK8+AK4","v":0},null,null,{"$f":"IF(D2=\"X\",-200000,IF(D2=\"Y\",-200000,IF(D2=\"Z\",-200000,IF(D2=\"\",-200000,IF(D2=\"Z Freilos\",-200000,IF(D2=\"\",(-90000),(F2*10000)+(H2*1000)+(J2*10)+E2-(G2*10000)-(I2*1000)+O2))))))","v":1002},{"$f":"IF(E2=0,\"\",RANK(M2,M2:M6))","v":2},{"$f":"'1. Runde Gruppen'!O3","v":0},{"$f":"IF(D2=\"\",\"\",D2)","v":"Valderrama Salvador"},{"$f":"IF(V2=\"\",\"\",1)","v":1},1,{"$f":"IF(Q2=\"\",\"\",R2)","v":1},"A",{"$f":"C2","v":"A1"},{"$f":"D2","v":"Valderrama Salvador"},{"$f":"C3","v":"A2"},{"$f":"D3","v":"Brachmanski Dave"},{"$f":"IFERROR(SMALL($S$2:$S$88,ROW()-1),\"\")","v":1},{"$f":"IFERROR(IF(Y2=\"\",\"\",VLOOKUP(Y2,$S$1:$V$88,4,FALSE)),\"\")","v":"Valderrama Salvador"},{"$f":"IFERROR(IF(Y2=\"\",\"\",VLOOKUP(Y2,$S$1:$X$88,6,FALSE)),\"\")","v":"Brachmanski Dave"},{"$f":"Matches!O2","v":2},{"$f":"Matches!P2","v":0},null,null,{"$f":"IFERROR(VLOOKUP(S2,$Y$2:$AC$88,4,FALSE),\"\")","v":2},{"$f":"IFERROR(VLOOKUP(S2,$Y$2:$AC$88,5,FALSE),\"\")","v":0},{"$f":"IF(AF2>AG2,1,0)","v":1},{"$f":"IF(AG2>AF2,1,0)","v":0},{"$f":"IF(AF2+AG2>=1,1,0)","v":1},{"$f":"IF(AND(AF2+AG2>1,AF2=AG2),1,0)","v":0},null,null,null,null,null,null,null,null,null,null,null,null,null,null,null,null,null,null,null,null,{"$f":"IF(Y2=\"\",\"\",VLOOKUP(Y2,$S$2:$T$88,2,FALSE))","v":"A"},null,{"$f":"IF(Y2=\"\",\"\",IF(Y2>0,ROW()-1))","v":1},{"$f":"IF($CS$1=\"X\",\"\",\"A1\")","v":"A1"},{"$f":"$BI$2","v":"A1"},{"$f":"$BI$2","v":"A1"},"A1","A1","A1","A1","A1","A1","A1","A1","A1","A1","A1","A1","A1","A1","A1","A1","A1","A1","A1","A1","A1","A1","A1","A1","A1","A1","A1","A1","A1","A1","A1",{"$f":"IFERROR(LOOKUP($CQ$1,$BI$1:$CP$1,BI2:CP2),\"\")","v":"A1"},{"$f":"CS44","v":"A1"},{"$f":"IF(CT1>0,Spieler!P2,\"\")","v":""},{"$f":"Spieler!Q2","v":""},{"$f":"IF($CQ$1<8,\"\",IF(CS2=CR2,\"\",CR2))","v":"A1"},{"$f":"IF(ROW(CU1)>COUNTA(CU:CU),\"\",INDEX(CU:CU,SMALL(IF(CU$2:CU$100<>\"\",ROW($2:$100)),ROW(CU1))))","v":"A1"},{"$f":"IFERROR(IF(CV2>\"\",CV2,\"\"),\"\")","v":"A1"},{"$f":"CS2","v":""},{"$f":"Spieler!C2","v":"Behling Oliver"},{"$f":"VLOOKUP(CY2,$DM$2:$DN$49,2,FALSE)","v":"D1"},{"$f":"CT2","v":""},{"$f":"IF(ROW(CX1)>COUNTA(CX:CX),\"\",INDEX(CX:CX,SMALL(IF(CX$2:CX$100<>\"\",ROW($2:$100)),ROW(CX1))))","v":"A1"},{"$f":"IFERROR(IF(DB2>\"\",DB2,\"\"),\"\")","v":"A1"},{"$f":"VLOOKUP(DC2,Spieler!$I$2:$J$41,2,FALSE)","v":"Valderrama Salvador"},null,{"$f":"IFERROR(IF(CT2=\"\",\"\",IF(CT2>\"\",RAND()*5000000)),\"\")","v":""},{"$f":"CS2","v":""},{"$f":"IF(CU2=\"\",\"\",RAND()*1000)","v":670.89587505534189},{"$f":"CU2","v":"A1"},{"$f":"IFERROR(LARGE($DF$2:$DG$9,1),\"\")","v":""},{"$f":"IFERROR(VLOOKUP(DJ2,$DF$2:$DG$9,2,FALSE),\"\")","v":""},null,{"$f":"CT2","v":""},{"$f":"DK2","v":""}]
[null,2,"A2",{"$f":"'1. Runde Gruppen'!D4","v":"Brachmanski Dave"},{"$f":"AJ2+AJ7+AJ3+AJ11","v":2},{"$f":"AI2+AH3+AH7+AH11","v":0},{"$f":"AH2+AI7+AI3+AI11","v":2},{"$f":"AG2+AF11+AF7+AF3","v":1},{"$f":"AF2+AG3+AG7+AG11","v":4},{"$f":"AK2+AK7+AK3+AK11","v":0},null,null,{"$f":"IF(D3=\"X\",-200000,IF(D3=\"Y\",-200000,IF(D3=\"Z\",-200000,IF(D3=\"\",-200000,IF(D3=\"Z Freilos\",-200000,IF(D3=\"\",(-90000),(F3*10000)+(H3*1000)+(J3*10)+E3-(G3*10000)-(I3*1000)+O3))))))","v":-22998},{"$f":"IF(E3=0,\"\",RANK(M3,M2:M6))","v":3},{"$f":"'1. Runde Gruppen'!O4","v":0},{"$f":"IF(D3=\"\",\"\",D3)","v":"Brachmanski Dave"},{"$f":"IF(V3=\"\",\"\",2)","v":""},{"$f":"IF(B5=4,41,9)","v":9},{"$f":"IF(Q3=\"\",\"\",R3)","v":""},"A",{"$f":"C4","v":"A3"},{"$f":"IF(X3=\"\",\"\",D3)","v":""},{"$f":"C5","v":"A4"},{"$f":"D5","v":""},{"$f":"IFERROR(SMALL($S$2:$S$88,ROW()-1),\"\")","v":2},{"$f":"IFERROR(IF(Y3=\"\",\"\",VLOOKUP(Y3,$S$1:$V$88,4,FALSE)),\"\")","v":"Drahn Robert"},{"$f":"IFERROR(IF(Y3=\"\",\"\",VLOOKUP(Y3,$S$1:$X$88,6,FALSE)),\"\")","v":"Brömel Frank"},{"$f":"Matches!O3","v":2},{"$f":"Matches!P3","v":0},null,null,{"$f":"IFERROR(VLOOKUP(S3,$Y$2:$AC$88,4,FALSE),\"\")","v":0},{"$f":"IFERROR(VLOOKUP(S3,$Y$2:$AC$88,5,FALSE),\"\")","v":0},{"$f":"IF(AF3>AG3,1,0)","v":0},{"$f":"IF(AG3>AF3,1,0)","v":0},{"$f":"IF(AF3+AG3>=1,1,0)","v":0},{"$f":"IF(AND(AF3+AG3>1,AF3=AG3),1,0)","v":0},null,null,null,null,null,null,null,null,null,null,null,null,null,null,null,null,null,null,null,null,{"$f":"IF(Y3=\"\",\"\",VLOOKUP(Y3,$S$2:$T$88,2,FALSE))","v":"B"},null,{"$f":"IF(Y3=\"\",\"\",IF(Y3>0,ROW()-1))","v":2},"A2","A2","A2","A2","A2","A2","A2","A2","A2","A2","A2","A2","A2","A2","A2","A2","A2","A2","A2","A2","A2","A2","A2","A2","A2","A2","A2","A2","A2","A2","A2","A2","A2","A2",{"$f":"IFERROR(LOOKUP($CQ$1,$BI$1:$CP$1,BI3:CP3),\"\")","v":"A2"},{"$f":"CS45","v":"A2"},{"$f":"IF(CT1>0,Spieler!P3,\"\")","v":""},{"$f":"Spieler!Q3","v":""},{"$f":"IF($CQ$1<8,\"\",IF(CS3=CR3,\"\",CR3))","v":"A2"},{"$f":"IF(ROW(CU2)>COUNTA(CU:CU),\"\",INDEX(CU:CU,SMALL(IF(CU$2:CU$100<>\"\",ROW($2:$100)),ROW(CU2))))","v":"A2"},"A2",{"$f":"CS3","v":""},{"$f":"Spieler!C3","v":"Brachmanski Dave"},{"$f":"VLOOKUP(CY3,$DM$2:$DN$49,2,FALSE)","v":"G2"},{"$f":"CT3","v":""},{"$f":"IF(ROW(CX2)>COUNTA(CX:CX),\"\",INDEX(CX:CX,SMALL(IF(CX$2:CX$100<>\"\",ROW($2:$100)),ROW(CX2))))","v":"A2"},{"$f":"IFERROR(IF(DB3>\"\",DB3,\"\"),\"\")","v":"A2"},{"$f":"VLOOKUP(DC3,Spieler!$I$2:$J$41,2,FALSE)","v":"Brachmanski Dave"},null,{"$f":"IFERROR(IF(CT3=\"\",\"\",IF(CT3>\"\",RAND()*5000000)),\"\")","v":""},{"$f":"CS3","v":""},{"$f":"IF(CU3=\"\",\"\",RAND()*1000)","v":706.05582814961599},{"$f":"CU3","v":"A2"},{"$f":"IFERROR(LARGE($DF$2:$DG$9,2),\"\")","v":""},{"$f":"IFERROR(VLOOKUP(DJ3,$DF$2:$DG$9,2,FALSE),\"\")","v":""},null,{"$f":"CT3","v":""},{"$f":"DK3","v":""}]
[null,3,"A3",{"$f":"'1. Runde Gruppen'!D5","v":"Gärtner David"},{"$f":"AJ5+AJ7+AJ10+AJ9","v":2},{"$f":"AI5+AI7+AH10+AH9","v":2},{"$f":"AH5+AH7+AI10+AI9","v":0},{"$f":"AG5+AG7+AF10+AF9","v":4},{"$f":"AF5+AF7+AG10+AG9","v":2},{"$f":"AK5+AK7+AK10+AK9","v":0},null,null,22002,{"$f":"IF(E4=0,\"\",RANK(M4,M2:M6))","v":1},{"$f":"'1. Runde Gruppen'!O5","v":0},{"$f":"IF(D4=\"\",\"\",D4)","v":"Gärtner David"},{"$f":"IF(V4=\"\",\"\",3)","v":""},17,"","A",{"$f":"C2","v":"A1"},{"$f":"IF(X4=\"\",\"\",D2)","v":""},{"$f":"C6","v":"A5"},{"$f":"D6","v":""},{"$f":"IFERROR(SMALL($S$2:$S$88,ROW()-1),\"\")","v":3},"Behling Oliver","Witzik Oliver",{"$f":"Matches!O4","v":0},{"$f":"Matches!P4","v":2},null,null,0,0,{"$f":"IF(AF4>AG4,1,0)","v":0},0,{"$f":"IF(AF4+AG4>=1,1,0)","v":0},0,null,null,null,null,null,null,null,null,null,null,null,null,null,null,null,null,null,null,null,null,"C",null,3,"A3","A3","A3","A3","A3","A3","A3","A3","A3","A3","A3","A3","A3","A3","A3","A3","A3","A3","A3","A3","A3","A3","A3","A3","A3","A3","A3","A3","A3","A3","A3","A3","A3","A3","A3","A3",{"$f":"IF(CT1>=3,Spieler!P4,\"\")","v":""},{"$f":"Spieler!Q4","v":""},"A3",{"$f":"IF(ROW(CU3)>COUNTA(CU:CU),\"\",INDEX(CU:CU,SMALL(IF(CU$2:CU$100<>\"\",ROW($2:$100)),ROW(CU3))))","v":"A3"},"A3","",{"$f":"Spieler!C4","v":"Brömel Frank"},"A3","",{"$f":"IF(ROW(CX3)>COUNTA(CX:CX),\"\",INDEX(CX:CX,SMALL(IF(CX$2:CX$100<>\"\",ROW($2:$100)),ROW(CX3))))","v":"A3"},"A3",{"$f":"VLOOKUP(DC4,Spieler!$I$2:$J$41,2,FALSE)","v":"Gärtner David"},null,"","",855.09735899097927,"A3",{"$f":"IFERROR(LARGE($DF$2:$DG$9,3),\"\")","v":""},{"$f":"IFERROR(VLOOKUP(DJ4,$DF$2:$DG$9,2,FALSE),\"\")","v":""},null,"",""]
[null,{"$f":"IF(D5=\"\",\"\",4)","v":""},"A4",{"$f":"'1. Runde Gruppen'!D6","v":""},{"$f":"AJ3+AJ6+AJ8+AJ10","v":0},{"$f":"AI3+AH6+AI8+AI10","v":0},{"$f":"AH3+AH8+AH10+AI6","v":0},{"$f":"AG3+AF6+AG8+AG10","v":0},{"$f":"AF3+AG6+AF8+AF10","v":0},{"$f":"AK3+AK8+AK10+AK6","v":0},null,null,-200000,{"$f":"IF(E5=0,\"\",RANK(M5,M2:M6))","v":""},{"$f":"'1. Runde Gruppen'!O6","v":0},{"$f":"IF(D5=\"\",\"\",D5)","v":""},{"$f":"IF(V5=\"\",\"\",4)","v":4},25,25,"A",{"$f":"C3","v":"A2"},{"$f":"D2","v":"Valderrama Salvador"},{"$f":"C4","v":"A3"},{"$f":"D4","v":"Gärtner David"},4,"Hartung Andreas","Suttner Magnus",{"$f":"Matches!O5","v":0},{"$f":"Matches!P5","v":2},null,null,1,2,0,1,1,0,null,null,null,null,null,null,null,null,null,null,null,null,null,null,null,null,null,null,null,null,"D",null,4,"A4","A4","A4","A4","A4",{"$f":"$BI$7","v":"B1"},"A4","A4","A4","A4","A4",{"$f":"$BI$7","v":"B1"},"A4","A4","A4","A4","A4",{"$f":"$BI$7","v":"B1"},"A4","A4","A4","A4","A4","A4","A4","A4","A4","A4","A4","A4","A4","A4","A4","A4",{"$f":"IFERROR(LOOKUP($CQ$1,$BI$1:$CP$1,BI5:CP5),\"\")","v":"B1"},"",{"$f":"IF(CT1>=4,Spieler!P5,\"\")","v":""},{"$f":"Spieler!Q5","v":""},"",{"$f":"IF(ROW(CU4)>COUNTA(CU:CU),\"\",INDEX(CU:CU,SMALL(IF(CU$2:CU$100<>\"\",ROW($2:$100)),ROW(CU4))))","v":"B1"},"B1","",{"$f":"Spieler!C5","v":"Delling Tino"},"F2","",{"$f":"IF(ROW(CX4)>COUNTA(CX:CX),\"\",INDEX(CX:CX,SMALL(IF(CX$2:CX$100<>\"\",ROW($2:$100)),ROW(CX4))))","v":"B1"},"B1",{"$f":"VLOOKUP(DC5,Spieler!$I$2:$J$41,2,FALSE)","v":"Drahn Robert"},null,"","","","",{"$f":"IFERROR(LARGE($DF$2:$DG$9,4),\"\")","v":""},"",null,"",""]
[null,{"$f":"IF(D6=\"\",\"\",5)","v":""},"A5",{"$f":"'1. Runde Gruppen'!D7","v":""},{"$f":"AJ4+AJ6+AJ9+AJ11","v":0},{"$f":"AI4+AI6+AI9+AI11","v":0},{"$f":"AH4+AH6+AH9+AH11","v":0},{"$f":"AG4+AG6+AG9+AG11","v":0},{"$f":"AF4+AF6+AF9+AF11","v":0},{"$f":"AK4+AK6+AK9+AK11","v":0},null,null,-200000,{"$f":"IF(E6=0,\"\",RANK(M6,M2:M6))","v":""},{"$f":"'1. Runde Gruppen'!O7","v":0},{"$f":"IF(D6=\"\",\"\",D6)","v":""},{"$f":"IF(V6=\"\",\"\",5)","v":""},33,"","A",{"$f":"C5","v":"A4"},{"$f":"IF(X6=\"\",\"\",D5)","v":""},{"$f":"C6","v":"A5"},{"$f":"D6","v":""},5,"Swennen Andy","Fandrei Andreas",{"$f":"Matches!O6","v":0},{"$f":"Matches!P6","v":2},null,null,0,0,{"$f":"IF(AF6>AG6,1,0)","v":0},0,0,0,null,null,null,null,null,null,null,null,null,null,null,null,null,null,null,null,null,null,null,null,"E",null,5,"A5",{"$f":"$BI$7","v":"B1"},"A5","A5",{"$f":"$BI$7","v":"B1"},"B2",{"$f":"$BI$7","v":"B1"},{"$f":"$BI$7","v":"B1"},{"$f":"$BI$7","v":"B1"},{"$f":"$BI$7","v":"B1"},{"$f":"$BI$7","v":"B1"},"B2",{"$f":"$BI$7","v":"B1"},{"$f":"$BI$7","v":"B1"},{"$f":"$BI$7","v":"B1"},{"$f":"$BI$7","v":"B1"},{"$f":"$BI$7","v":"B1"},"B2",{"$f":"$BI$7","v":"B1"},"B1","B1","B1","B1","B1","B1","B1","A5","A5","A5","A5","A5","A5","A5","A5","B2","",{"$f":"IF(CT1>=5,Spieler!P6,\"\")","v":""},{"$f":"Spieler!Q6","v":""},{"$f":"IF($CQ$1<8,\"\",IF(CS3=CR6,\"\",CR6))","v":""},{"$f":"IF(ROW(CU5)>COUNTA(CU:CU),\"\",INDEX(CU:CU,SMALL(IF(CU$2:CU$100<>\"\",ROW($2:$100)),ROW(CU5))))","v":"B2"},"B2","",{"$f":"Spieler!C6","v":"Drahn Robert"},"H2","",{"$f":"IF(ROW(CX5)>COUNTA(CX:CX),\"\",INDEX(CX:CX,SMALL(IF(CX$2:CX$100<>\"\",ROW($2:$100)),ROW(CX5))))","v":"B2"},"B2",{"$f":"VLOOKUP(DC6,Spieler!$I$2:$J$41,2,FALSE)","v":"Brömel Frank"},null,"","","","",{"$f":"IFERROR(LARGE($DF$2:$DG$9,5),\"\")","v":""},"",null,"",""]
[null,null,null,null,null,null,null,null,null,null,null,null,null,null,null,null,{"$f":"IF(V7=\"\",\"\",6)","v":6},{"$f":"IF(B5=4,65,41)","v":41},41,"A",{"$f":"C2","v":"A1"},{"$f":"D3","v":"Brachmanski Dave"},{"$f":"C4","v":"A3"},"Gärtner David",6,"Jeroch Paul","Müller Marcus",{"$f":"Matches!O7","v":2},{"$f":"Matches!P7","v":0},null,null,1,2,0,{"$f":"IF(AG7>AF7,1,0)","v":1},1,0,null,null,null,null,null,null,null,null,null,null,null,null,null,null,null,null,null,null,null,null,"F",null,6,{"$f":"IF($CS$1=\"X\",\"\",\"B1\")","v":"B1"},"B2",{"$f":"$BI$7","v":"B1"},"B1","B2","B3","B2","B2","B2","B2","B2","B3","B2","B2","B2","B2","B2","B3","B2","B2","B2","B2","B2","B2","B2","B2",{"$f":"$BI$7","v":"B1"},"B1","B1","B1","B1","B1","B1","B1","B3","B1",{"$f":"IF(CT1>=6,Spieler!P7,\"\")","v":""},{"$f":"Spieler!Q7","v":""},{"$f":"IF($CQ$1<8,\"\",IF(CS3=CR7,\"\",CR7))","v":"B1"},{"$f":"IF(ROW(CU6)>COUNTA(CU:CU),\"\",INDEX(CU:CU,SMALL(IF(CU$2:CU$100<>\"\",ROW($2:$100)),ROW(CU6))))","v":"B3"},"B3","",{"$f":"Spieler!C7","v":"Elham Faiz"},{"$f":"VLOOKUP(CY7,$DM$2:$DN$49,2,FALSE)","v":"D3"},"",{"$f":"IF(ROW(CX6)>COUNTA(CX:CX),\"\",INDEX(CX:CX,SMALL(IF(CX$2:CX$100<>\"\",ROW($2:$100)),ROW(CX6))))","v":"B3"},"B3",{"$f":"VLOOKUP(DC7,Spieler!$I$2:$J$41,2,FALSE)","v":"Weber Marco"},null,"","",29.113463341337244,"B1",{"$f":"IFERROR(LARGE($DF$2:$DG$9,6),\"\")","v":""},"",null,"",""]
[null,null,null,null,null,null,null,null,null,null,null,null,null,null,null,null,{"$f":"IF(V8=\"\",\"\",7)","v":""},49,"","A",{"$f":"C3","v":"A2"},{"$f":"IF(X8=\"\",\"\",D2)","v":""},"A4","",7,"Löffel Ulrich","Stachly Marec",{"$f":"Matches!O8","v":0},{"$f":"Matches!P8","v":2},null,null,0,0,0,0,0,0,null,null,null,null,null,null,null,null,null,null,null,null,null,null,null,null,null,null,null,null,"G",null,7,"B2","B3","B2","B2","B3",{"$f":"$BI$12","v":"C1"},"B3","B3","B3","B3","B3",{"$f":"$BI$12","v":"C1"},"B3","B3","B3","B3","B3",{"$f":"$BI$12","v":"C1"},"B3","B3","B3","B3","B3","B3","B3","B3","B2","B2","B2","B2","B2","B2","B2","B2","C1","B2",{"$f":"IF(CT1>=7,Spieler!P8,\"\")","v":""},{"$f":"Spieler!Q8","v":""},{"$f":"IF($CQ$1<8,\"\",IF(CS8=CR8,\"\",CR8))","v":"B2"},{"$f":"IF(ROW(CU7)>COUNTA(CU:CU),\"\",INDEX(CU:CU,SMALL(IF(CU$2:CU$100<>\"\",ROW($2:$100)),ROW(CU7))))","v":"C1"},"C1","",{"$f":"Spieler!C8","v":"Fandrei Andreas"},"A2","",{"$f":"IF(ROW(CX7)>COUNTA(CX:CX),\"\",INDEX(CX:CX,SMALL(IF(CX$2:CX$100<>\"\",ROW($2:$100)),ROW(CX7))))","v":"C1"},"C1",{"$f":"VLOOKUP(DC8,Spieler!$I$2:$J$41,2,FALSE)","v":"Behling Oliver"},null,"","",382.17031657253574,"B2",{"$f":"IFERROR(LARGE($DF$2:$DG$9,7),\"\")","v":""},"",null,"",""]
[null,null,null,null,null,null,null,null,null,null,null,null,null,null,null,null,{"$f":"IF(V9=\"\",\"\",8)","v":""},57,"","A",{"$f":"C4","v":"A3"},{"$f":"IF(X9=\"\",\"\",D4)","v":""},"A5","",8,"Elham Faiz","Fandrei Joel",{"$f":"Matches!O9","v":0},{"$f":"Matches!P9","v":2},null,null,0,0,0,0,0,0,null,null,null,null,null,null,null,null,null,null,null,null,null,null,null,null,null,null,null,null,"H",null,8,"B3","B4","B3","B3","B4","C2",{"$f":"$BI$12","v":"C1"},"B4","B4","B4","B4","C2",{"$f":"$BI$12","v":"C1"},"B4","B4","B4","B4","C2",{"$f":"$BI$12","v":"C1"},"B4","B4","B4","B4","B4","B4","B4","B3","B3","B3","B3","B3","B3","B3","B3","C2","B3",{"$f":"IF(CT1=8,Spieler!P9,\"\")","v":""},{"$f":"Spieler!Q9","v":""},"B3",{"$f":"IF(ROW(CU8)>COUNTA(CU:CU),\"\",INDEX(CU:CU,SMALL(IF(CU$2:CU$100<>\"\",ROW($2:$100)),ROW(CU8))))","v":"C2"},"C2","",{"$f":"Spieler!C9","v":"Fandrei Joel"},"E3","",{"$f":"IF(ROW(CX8)>COUNTA(CX:CX),\"\",INDEX(CX:CX,SMALL(IF(CX$2:CX$100<>\"\",ROW($2:$100)),ROW(CX8))))","v":"C2"},"C2",{"$f":"VLOOKUP(DC9,Spieler!$I$2:$J$41,2,FALSE)","v":"Witzik Oliver"},null,"","",402.34136637226317,"B3",{"$f":"IFERROR(LARGE($DF$2:$DG$9,8),\"\")","v":""},"",null,"",""]
[null,null,null,null,null,null,null,null,null,null,null,null,null,null,null,null,{"$f":"IF(V10=\"\",\"\",9)","v":""},{"$f":"IF(B5=4,9,65)","v":65},{"$f":"IF(Q10=\"\",\"\",R10)","v":""},"A",{"$f":"C2","v":"A1"},{"$f":"IF(X10=\"\",\"\",D4)","v":""},{"$f":"C5","v":"A4"},{"$f":"D5","v":""},25,{"$f":"IFERROR(IF(Y10=\"\",\"\",VLOOKUP(Y10,$S$1:$V$88,4,FALSE)),\"\")","v":"Valderrama Salvador"},{"$f":"IFERROR(IF(Y10=\"\",\"\",VLOOKUP(Y10,$S$1:$X$88,6,FALSE)),\"\")","v":"Gärtner David"},{"$f":"Matches!O10","v":1},{"$f":"Matches!P10","v":2},null,null,0,0,0,0,0,0,null,null,null,null,null,null,null,null,null,null,null,null,null,null,null,null,null,null,null,null,"A",null,9,"B4",null,"B4","B4",{"$f":"$BI$12","v":"C1"},"C3","C2",{"$f":"$BI$12","v":"C1"},{"$f":"$BI$12","v":"C1"},{"$f":"$BI$12","v":"C1"},{"$f":"$BI$12","v":"C1"},"C3","C2",{"$f":"$BI$12","v":"C1"},{"$f":"$BI$12","v":"C1"},{"$f":"$BI$12","v":"C1"},{"$f":"$BI$12","v":"C1"},"C3","C2",{"$f":"$BI$12","v":"C1"},"C1","C1","C1","C1","C1","C1","B4","B4","B4","B4","B4","B4","B4","B4","C3","",null,null,"",{"$f":"IF(ROW(CU9)>COUNTA(CU:CU),\"\",INDEX(CU:CU,SMALL(IF(CU$2:CU$100<>\"\",ROW($2:$100)),ROW(CU9))))","v":"C3"},"C3",{"$f":"CW2","v":"A1"},{"$f":"Spieler!C10","v":"Gärtner David"},"A1",{"$f":"Spieler!N10","v":"Behling Oliver"},{"$f":"IF(ROW(CX9)>COUNTA(CX:CX),\"\",INDEX(CX:CX,SMALL(IF(CX$2:CX$100<>\"\",ROW($2:$100)),ROW(CX9))))","v":"C3"},"C3",{"$f":"VLOOKUP(DC10,Spieler!$I$2:$J$41,2,FALSE)","v":"Isermann Rene"},null,null,null,"","",{"$f":"IFERROR(LARGE($DH$2:$DH$41,1),\"\")","v":941.14753690256316},{"$f":"IFERROR(VLOOKUP(DJ10,$DH$2:$DI$41,2,FALSE),\"\")","v":"D1"},null,{"$f":"DA10","v":"Behling Oliver"},{"$f":"DK10","v":"D1"}]
[null,null,null,null,null,null,null,null,null,null,null,null,null,null,null,null,{"$f":"IF(V11=\"\",\"\",10)","v":""},73,"","A",{"$f":"C3","v":"A2"},{"$f":"IF(X11=\"\",\"\",D3)","v":""},{"$f":"C6","v":"A5"},{"$f":"D6","v":""},26,"Drahn Robert","Weber Marco",{"$f":"Matches!O11","v":0},{"$f":"Matches!P11","v":2},null,null,0,0,0,0,0,0,null,null,null,null,null,null,null,null,null,null,null,null,null,null,null,null,null,null,null,null,"B",null,10,"B5",null,null,"B5","C2",{"$f":"$BI$17","v":"D1"},"C3","C2","C2","C2","C2",{"$f":"$BI$17","v":"D1"},"C3","C2","C2","C2","C2",{"$f":"$BI$17","v":"D1"},"C3","C2","C2","C2","C2","C2","C2","C2",{"$f":"$BI$12","v":"C1"},"B5","B5","B5","B5","B5","B5","B5","D1","",null,null,"",{"$f":"IF(ROW(CU10)>COUNTA(CU:CU),\"\",INDEX(CU:CU,SMALL(IF(CU$2:CU$100<>\"\",ROW($2:$100)),ROW(CU10))))","v":"D1"},"D1",{"$f":"CW3","v":"A2"},{"$f":"Spieler!C11","v":"Hartung Andreas"},"C1",{"$f":"Spieler!N11","v":"Brachmanski Dave"},{"$f":"IF(ROW(CX10)>COUNTA(CX:CX),\"\",INDEX(CX:CX,SMALL(IF(CX$2:CX$100<>\"\",ROW($2:$100)),ROW(CX10))))","v":"D1"},"D1",{"$f":"VLOOKUP(DC11,Spieler!$I$2:$J$41,2,FALSE)","v":"Hartung Andreas"},null,null,null,"","",{"$f":"IFERROR(LARGE($DH$2:$DH$41,2),\"\")","v":905.14395872358216},{"$f":"IFERROR(VLOOKUP(DJ11,$DH$2:$DI$41,2,FALSE),\"\")","v":"G2"},null,{"$f":"DA11","v":"Brachmanski Dave"},"G2"]
["B",null,null,"Spieler","M","W","L","F+","F-","U",null,null,"Rang","Rang","P+",null,null,null,"",null,null,null,null,null,27,"Behling Oliver","Isermann Rene",{"$f":"Matches!O12","v":2},{"$f":"Matches!P12","v":0},null,null,null,null,null,null,null,null,null,null,null,null,null,null,null,null,null,null,null,null,null,null,null,null,null,null,null,null,"C",null,11,{"$f":"IF($CS$1=\"X\",\"\",\"C1\")","v":"C1"},null,null,null,"C3","D2",{"$f":"$BI$17","v":"D1"},"C3","C3","C3","C3","D2",{"$f":"$BI$17","v":"D1"},"C3","C3","C3","C3","D2",{"$f":"$BI$17","v":"D1"},"C3","C3","C3","C3","C3","C3","C3","C2",{"$f":"$BI$12","v":"C1"},"C1","C1","C1","C1","C1","C1","D2","C1",null,null,{"$f":"IF($CQ$1<8,\"\",IF(CS4=CR12,\"\",CR12))","v":"C1"},{"$f":"IF(ROW(CU11)>COUNTA(CU:CU),\"\",INDEX(CU:CU,SMALL(IF(CU$2:CU$100<>\"\",ROW($2:$100)),ROW(CU11))))","v":"D2"},"D2","A3",{"$f":"Spieler!C12","v":"Hofmann Frank"},"C3",{"$f":"Spieler!N12","v":"Brömel Frank"},{"$f":"IF(ROW(CX11)>COUNTA(CX:CX),\"\",INDEX(CX:CX,SMALL(IF(CX$2:CX$100<>\"\",ROW($2:$100)),ROW(CX11))))","v":"D2"},"D2",{"$f":"VLOOKUP(DC12,Spieler!$I$2:$J$41,2,FALSE)","v":"Suttner Magnus"},null,null,null,634.33680299083676,"C1",{"$f":"IFERROR(LARGE($DH$2:$DH$41,3),\"\")","v":855.09735899097927},"A3",null,"Brömel Frank","A3"]
[null,1,"B1",{"$f":"'1. Runde Gruppen'!T3","v":"Drahn Robert"},{"$f":"AJ13+AJ16+AJ19+AJ15","v":2},{"$f":"AH13+AH16+AH19+AH15","v":1},{"$f":"AI13+AI16+AI19+AI15","v":1},{"$f":"AF13+AF16+AF19+AF15","v":2},{"$f":"AG13+AG16+AG19+AG15","v":2},{"$f":"AK13+AK16+AK19+AK15","v":0},null,null,{"$f":"IF(D13=\"X\",-200000,IF(D13=\"Y\",-200000,IF(D13=\"Z\",-200000,IF(D13=\"\",-200000,IF(D13=\"Z Freilos\",-200000,IF(D13=\"\",(-90000),(F13*10000)+(H13*1000)+(J13*10)+E13-(G13*10000)-(I13*1000)+O13))))))","v":2},{"$f":"IF(E13=0,\"\",RANK(M13,M13:M17))","v":2},{"$f":"'1. Runde Gruppen'!AE3","v":0},{"$f":"IF(D13=\"\",\"\",D13)","v":"Drahn Robert"},{"$f":"IF(V13=\"\",\"\",1)","v":1},2,2,"B",{"$f":"C13","v":"B1"},{"$f":"D13","v":"Drahn Robert"},{"$f":"C14","v":"B2"},{"$f":"D14","v":"Brömel Frank"},28,"Hartung Andreas","Straßburger Marko",{"$f":"Matches!O13","v":1},{"$f":"Matches!P13","v":2},null,null,{"$f":"IFERROR(VLOOKUP(S13,$Y$2:$AC$88,4,FALSE),\"\")","v":2},{"$f":"IFERROR(VLOOKUP(S13,$Y$2:$AC$88,5,FALSE),\"\")","v":0},{"$f":"IF(AF13>AG13,1,0)","v":1},{"$f":"IF(AG13>AF13,1,0)","v":0},{"$f":"IF(AF13+AG13>=1,1,0)","v":1},{"$f":"IF(AND(AF13+AG13>1,AF13=AG13),1,0)","v":0},null,null,null,null,null,null,null,null,null,null,null,null,null,null,null,null,null,null,null,null,"D",null,12,"C2",null,null,null,null,"D3","D2",{"$f":"$BI$17","v":"D1"},"C4","C4",{"$f":"$BI$17","v":"D1"},"D3","D2",{"$f":"$BI$17","v":"D1"},"C4","C4","C4","D3","D2",{"$f":"$BI$17","v":"D1"},"C4","C4","C4","C4","C4","C4","C3","C2","C2","C2","C2","C2","C2","C2","D3","C2",null,null,"C2",{"$f":"IF(ROW(CU12)>COUNTA(CU:CU),\"\",INDEX(CU:CU,SMALL(IF(CU$2:CU$100<>\"\",ROW($2:$100)),ROW(CU12))))","v":"D3"},"D3","B1",{"$f":"Spieler!C13","v":"Isermann Rene"},"E2",{"$f":"Spieler!N13","v":"Delling Tino"},{"$f":"IF(ROW(CX12)>COUNTA(CX:CX),\"\",INDEX(CX:CX,SMALL(IF(CX$2:CX$100<>\"\",ROW($2:$100)),ROW(CX12))))","v":"D3"},"D3",{"$f":"VLOOKUP(DC13,Spieler!$I$2:$J$41,2,FALSE)","v":"Straßburger Marko"},null,null,null,324.5262178714633,"C2",{"$f":"IFERROR(LARGE($DH$2:$DH$41,4),\"\")","v":784.74592576861824},"F2",null,{"$f":"DA13","v":"Delling Tino"},"F2"]
[null,2,"B2",{"$f":"'1. Runde Gruppen'!T4","v":"Brömel Frank"},{"$f":"AJ13+AJ18+AJ14+AJ22","v":2},{"$f":"AI13+AH14+AH18+AH22","v":0},{"$f":"AH13+AI18+AI14+AI22","v":2},{"$f":"AG13+AF22+AF18+AF14","v":0},{"$f":"AF13+AG14+AG18+AG22","v":4},{"$f":"AK13+AK18+AK14+AK22","v":0},null,null,{"$f":"IF(D14=\"X\",-200000,IF(D14=\"Y\",-200000,IF(D14=\"Z\",-200000,IF(D14=\"\",-200000,IF(D14=\"Z Freilos\",-200000,IF(D14=\"\",(-90000),(F14*10000)+(H14*1000)+(J14*10)+E14-(G14*10000)-(I14*1000)+O14))))))","v":-23998},{"$f":"IF(E14=0,\"\",RANK(M14,M13:M17))","v":3},{"$f":"'1. Runde Gruppen'!AE4","v":0},{"$f":"IF(D14=\"\",\"\",D14)","v":"Brömel Frank"},{"$f":"IF(V14=\"\",\"\",2)","v":""},{"$f":"IF(B16=4,42,10)","v":10},"","B",{"$f":"C15","v":"B3"},{"$f":"IF(X14=\"\",\"\",D14)","v":""},{"$f":"C16","v":"B4"},{"$f":"D16","v":""},29,"Swennen Andy","Delling Tino",{"$f":"Matches!O14","v":0},{"$f":"Matches!P14","v":2},null,null,{"$f":"IFERROR(VLOOKUP(S14,$Y$2:$AC$88,4,FALSE),\"\")","v":0},{"$f":"IFERROR(VLOOKUP(S14,$Y$2:$AC$88,5,FALSE),\"\")","v":0},0,0,{"$f":"IF(AF14+AG14>=1,1,0)","v":0},{"$f":"IF(AND(AF14+AG14>1,AF14=AG14),1,0)","v":0},null,null,null,null,null,null,null,null,null,null,null,null,null,null,null,null,null,null,null,null,"E",null,13,"C3",null,null,null,null,null,"D3","D2",{"$f":"$BI$17","v":"D1"},{"$f":"$BI$17","v":"D1"},"D2",{"$f":"$BI$22","v":"E1"},"D3","D2",{"$f":"$BI$17","v":"D1"},{"$f":"$BI$17","v":"D1"},{"$f":"BI17","v":"D1"},{"$f":"$BI$22","v":"E1"},"D3","D2",{"$f":"$BI$17","v":"D1"},"D1","D1","D1","D1","D1","C4","C3","C3","C3","C3","C3","C3","C3","E1","C3",null,null,"C3",{"$f":"IF(ROW(CU13)>COUNTA(CU:CU),\"\",INDEX(CU:CU,SMALL(IF(CU$2:CU$100<>\"\",ROW($2:$100)),ROW(CU13))))","v":"E1"},"E1","B2",{"$f":"Spieler!C14","v":"Jeroch Paul"},"B3",{"$f":"Spieler!N14","v":"Drahn Robert"},{"$f":"IF(ROW(CX13)>COUNTA(CX:CX),\"\",INDEX(CX:CX,SMALL(IF(CX$2:CX$100<>\"\",ROW($2:$100)),ROW(CX13))))","v":"E1"},"E1",{"$f":"VLOOKUP(DC14,Spieler!$I$2:$J$41,2,FALSE)","v":"Swennen Andy"},null,null,null,458.1290042318916,"C3",{"$f":"IFERROR(LARGE($DH$2:$DH$41,5),\"\")","v":725.42227540397676},"H2",null,"Drahn Robert",{"$f":"DK14","v":"H2"}]
[null,3,"B3",{"$f":"'1. Runde Gruppen'!T5","v":"Weber Marco"},{"$f":"AJ16+AJ18+AJ21+AJ20","v":2},{"$f":"AI16+AI18+AH21+AH20","v":2},{"$f":"AH16+AH18+AI21+AI20","v":0},{"$f":"AG16+AG18+AF21+AF20","v":4},{"$f":"AF16+AF18+AG21+AG20","v":0},{"$f":"AK16+AK18+AK21+AK20","v":0},null,null,24002,{"$f":"IF(E15=0,\"\",RANK(M15,M13:M17))","v":1},{"$f":"'1. Runde Gruppen'!AE5","v":0},{"$f":"IF(D15=\"\",\"\",D15)","v":"Weber Marco"},{"$f":"IF(V15=\"\",\"\",3)","v":""},18,"","B",{"$f":"C13","v":"B1"},{"$f":"IF(X15=\"\",\"\",D13)","v":""},{"$f":"C17","v":"B5"},{"$f":"D17","v":""},30,"Jeroch Paul",{"$f":"IFERROR(IF(Y15=\"\",\"\",VLOOKUP(Y15,$S$1:$X$88,6,FALSE)),\"\")","v":"Rejke Ronny"},{"$f":"Matches!O15","v":2},{"$f":"Matches!P15","v":1},null,null,0,0,0,0,{"$f":"IF(AF15+AG15>=1,1,0)","v":0},0,null,null,null,null,null,null,null,null,null,null,null,null,null,null,null,null,null,null,null,null,"F",null,14,"C4",null,null,null,null,null,null,"D3","D2","D2","D3","E2",{"$f":"$BI$22","v":"E1"},"D3","D2","D2",{"$f":"BI18","v":"D2"},"E2",{"$f":"$BI$22","v":"E1"},"D3","D2","D2","D2","D2","D2","D2",{"$f":"$BI$17","v":"D1"},"C4","C4","C4","C4","C4","C4","C4","E2","",null,null,"",{"$f":"IF(ROW(CU14)>COUNTA(CU:CU),\"\",INDEX(CU:CU,SMALL(IF(CU$2:CU$100<>\"\",ROW($2:$100)),ROW(CU14))))","v":"E2"},"E2","B3",{"$f":"Spieler!C15","v":"Löffel Ulrich"},"B2",{"$f":"Spieler!N15","v":"Elham Faiz"},{"$f":"IF(ROW(CX14)>COUNTA(CX:CX),\"\",INDEX(CX:CX,SMALL(IF(CX$2:CX$100<>\"\",ROW($2:$100)),ROW(CX14))))","v":"E2"},"E2",{"$f":"VLOOKUP(DC15,Spieler!$I$2:$J$41,2,FALSE)","v":"Fandrei Andreas"},null,null,null,"","",{"$f":"IFERROR(LARGE($DH$2:$DH$41,6),\"\")","v":723.14199118606791},"D3",null,"Elham Faiz","D3"]
[null,{"$f":"IF(D16=\"\",\"\",4)","v":""},"B4",{"$f":"'1. Runde Gruppen'!T6","v":""},{"$f":"AJ14+AJ17+AJ19+AJ21","v":0},{"$f":"AI14+AH17+AI19+AI21","v":0},{"$f":"AH14+AH19+AH21+AI17","v":0},{"$f":"AG14+AF17+AG19+AG21","v":0},{"$f":"AF14+AG17+AF19+AF21","v":0},{"$f":"AK14+AK19+AK21+AK17","v":0},null,null,-200000,{"$f":"IF(E16=0,\"\",RANK(M16,M13:M17))","v":""},{"$f":"'1. Runde Gruppen'!AE6","v":0},{"$f":"IF(D16=\"\",\"\",D16)","v":""},{"$f":"IF(V16=\"\",\"\",4)","v":4},26,26,"B",{"$f":"C14","v":"B2"},{"$f":"D13","v":"Drahn Robert"},{"$f":"C15","v":"B3"},{"$f":"D15","v":"Weber Marco"},31,"Löffel Ulrich","Hofmann Frank",{"$f":"Matches!O16","v":0},{"$f":"Matches!P16","v":2},null,null,0,2,0,1,1,0,null,null,null,null,null,null,null,null,null,null,null,null,null,null,null,null,null,null,null,null,"G",null,15,"C5",null,null,null,null,null,null,null,"D3","D3",{"$f":"$BI$22","v":"E1"},"E3","E2",{"$f":"$BI$22","v":"E1"},"D3","D3",{"$f":"BI19","v":"D3"},"E3","E2",{"$f":"$BI$22","v":"E1"},"D3","D3","D3","D3","D3","D3","D2",{"$f":"$BI$17","v":"D1"},"C5","C5","C5","C5","C5","C5","E3","",null,null,"",{"$f":"IF(ROW(CU15)>COUNTA(CU:CU),\"\",INDEX(CU:CU,SMALL(IF(CU$2:CU$100<>\"\",ROW($2:$100)),ROW(CU15))))","v":"E3"},"E3","C1",{"$f":"Spieler!C16","v":"Müller Marcus"},"H1",{"$f":"Spieler!N16","v":"Fandrei Andreas"},{"$f":"IF(ROW(CX15)>COUNTA(CX:CX),\"\",INDEX(CX:CX,SMALL(IF(CX$2:CX$100<>\"\",ROW($2:$100)),ROW(CX15))))","v":"E3"},"E3",{"$f":"VLOOKUP(DC16,Spieler!$I$2:$J$41,2,FALSE)","v":"Delling Tino"},null,null,null,"","",{"$f":"IFERROR(LARGE($DH$2:$DH$41,7),\"\")","v":706.05582814961599},"A2",null,"Fandrei Andreas","A2"]
[null,{"$f":"IF(D17=\"\",\"\",5)","v":""},"B5",{"$f":"'1. Runde Gruppen'!T7","v":""},{"$f":"AJ15+AJ17+AJ20+AJ22","v":0},{"$f":"AI15+AI17+AI20+AI22","v":0},{"$f":"AH15+AH17+AH20+AH22","v":0},{"$f":"AG15+AG17+AG20+AG22","v":0},{"$f":"AF15+AF17+AF20+AF22","v":0},{"$f":"AK15+AK17+AK20+AK22","v":0},null,null,-200000,{"$f":"IF(E17=0,\"\",RANK(M17,M13:M17))","v":""},{"$f":"'1. Runde Gruppen'!AE7","v":0},{"$f":"IF(D17=\"\",\"\",D17)","v":""},{"$f":"IF(V17=\"\",\"\",5)","v":""},34,"","B",{"$f":"C16","v":"B4"},{"$f":"IF(X17=\"\",\"\",D16)","v":""},{"$f":"C17","v":"B5"},{"$f":"D17","v":""},32,"Elham Faiz","Thomas Moritz",{"$f":"Matches!O17","v":1},{"$f":"Matches!P17","v":2},null,null,0,0,0,0,0,0,null,null,null,null,null,null,null,null,null,null,null,null,null,null,null,null,null,null,null,null,"H",null,16,{"$f":"IF($CS$1=\"X\",\"\",\"D1\")","v":"D1"},null,null,null,null,null,null,null,null,"D4","E2",{"$f":"$BI$27","v":"F1"},"E3","E2",{"$f":"$BI$22","v":"E1"},"D4",{"$f":"BI20","v":"D4"},{"$f":"$BI$27","v":"F1"},"E3","E2",{"$f":"$BI$22","v":"E1"},"D4","D4","D4","D4","D4","D3","D2",{"$f":"$BI$17","v":"D1"},"D1","D1","D1","D1","D1","F1","D1",null,null,{"$f":"IF($CQ$1<8,\"\",IF(CS5=CR17,\"\",CR17))","v":"D1"},{"$f":"IF(ROW(CU16)>COUNTA(CU:CU),\"\",INDEX(CU:CU,SMALL(IF(CU$2:CU$100<>\"\",ROW($2:$100)),ROW(CU16))))","v":"F1"},"F1","C2",{"$f":"Spieler!C17","v":"Rejke Ronny"},"D2",{"$f":"Spieler!N17","v":"Fandrei Joel"},{"$f":"IF(ROW(CX16)>COUNTA(CX:CX),\"\",INDEX(CX:CX,SMALL(IF(CX$2:CX$100<>\"\",ROW($2:$100)),ROW(CX16))))","v":"F1"},"F1",{"$f":"VLOOKUP(DC17,Spieler!$I$2:$J$41,2,FALSE)","v":"Jeroch Paul"},null,null,null,941.14753690256316,"D1",{"$f":"IFERROR(LARGE($DH$2:$DH$41,8),\"\")","v":697.5277483682388},"E3",null,"Fandrei Joel","E3"]
[null,null,null,null,null,null,null,null,null,null,null,null,null,null,null,null,{"$f":"IF(V18=\"\",\"\",6)","v":6},{"$f":"IF(B16=4,66,42)","v":42},42,"B",{"$f":"C13","v":"B1"},{"$f":"D14","v":"Brömel Frank"},{"$f":"C15","v":"B3"},"Weber Marco",41,"Brachmanski Dave","Gärtner David",{"$f":"Matches!O18","v":1},{"$f":"Matches!P18","v":2},null,null,0,2,0,1,1,0,null,null,null,null,null,null,null,null,null,null,null,null,null,null,null,null,null,null,null,null,"A",null,17,"D2",null,null,null,null,null,null,null,null,null,"E3","F2",{"$f":"$BI$27","v":"F1"},"E3","E2",{"$f":"$BI$22","v":"E1"},{"$f":"BI22","v":"E1"},"F2",{"$f":"$BI$27","v":"F1"},"E3","E2",{"$f":"$BI$22","v":"E1"},{"$f":"$BI$22","v":"E1"},{"$f":"$BI$22","v":"E1"},{"$f":"$BI$22","v":"E1"},{"$f":"$BI$22","v":"E1"},"D4","D3","D2","D2","D2","D2","D2","D2","F2","D2",null,null,"D2",{"$f":"IF(ROW(CU17)>COUNTA(CU:CU),\"\",INDEX(CU:CU,SMALL(IF(CU$2:CU$100<>\"\",ROW($2:$100)),ROW(CU17))))","v":"F2"},"F2","C3",{"$f":"Spieler!C18","v":"Stachly Marec"},"C2",{"$f":"Spieler!N18","v":"Gärtner David"},{"$f":"IF(ROW(CX17)>COUNTA(CX:CX),\"\",INDEX(CX:CX,SMALL(IF(CX$2:CX$100<>\"\",ROW($2:$100)),ROW(CX17))))","v":"F2"},"F2",{"$f":"VLOOKUP(DC18,Spieler!$I$2:$J$41,2,FALSE)","v":"Müller Marcus"},null,null,null,332.09289760510853,"D2",{"$f":"IFERROR(LARGE($DH$2:$DH$41,9),\"\")","v":670.89587505534189},"A1",null,"Gärtner David","A1"]
[null,null,null,null,null,null,null,null,null,null,null,null,null,null,null,null,{"$f":"IF(V19=\"\",\"\",7)","v":""},50,"","B",{"$f":"C14","v":"B2"},{"$f":"IF(X19=\"\",\"\",D13)","v":""},"B4","",42,"Brömel Frank","Weber Marco",{"$f":"Matches!O19","v":0},{"$f":"Matches!P19","v":2},null,null,0,0,0,0,0,0,null,null,null,null,null,null,null,null,null,null,null,null,null,null,null,null,null,null,null,null,"B",null,18,"D3",null,null,null,null,null,null,null,null,null,null,"F3","F2",{"$f":"$BI$27","v":"F1"},"E3","E2",{"$f":"BI23","v":"E2"},"F3","F2",{"$f":"$BI$27","v":"F1"},"E3","E2","E2","E2","E2","E2",{"$f":"$BI$22","v":"E1"},"D4","D3","D3","D3","D3","D3","D3","F3","D3",null,null,"D3",{"$f":"IF(ROW(CU18)>COUNTA(CU:CU),\"\",INDEX(CU:CU,SMALL(IF(CU$2:CU$100<>\"\",ROW($2:$100)),ROW(CU18))))","v":"F3"},"F3","D1",{"$f":"Spieler!C19","v":"Straßburger Marko"},"F1",{"$f":"Spieler!N19","v":"Hartung Andreas"},{"$f":"IF(ROW(CX18)>COUNTA(CX:CX),\"\",INDEX(CX:CX,SMALL(IF(CX$2:CX$100<>\"\",ROW($2:$100)),ROW(CX18))))","v":"F3"},"F3",{"$f":"VLOOKUP(DC19,Spieler!$I$2:$J$41,2,FALSE)","v":"Rejke Ronny"},null,null,null,723.14199118606791,"D3",{"$f":"IFERROR(LARGE($DH$2:$DH$41,10),\"\")","v":634.33680299083676},"C1",null,"Hartung Andreas","C1"]
[null,null,null,null,null,null,null,null,null,null,null,null,null,null,null,null,{"$f":"IF(V20=\"\",\"\",8)","v":""},58,"","B",{"$f":"C15","v":"B3"},{"$f":"IF(X20=\"\",\"\",D15)","v":""},"B5","",43,"Witzik Oliver","Isermann Rene",{"$f":"Matches!O20","v":2},{"$f":"Matches!P20","v":0},null,null,0,0,0,0,0,0,null,null,null,null,null,null,null,null,null,null,null,null,null,null,null,null,null,null,null,null,"C",null,19,"D4",null,null,null,null,null,null,null,null,null,null,null,"F3","F2",{"$f":"$BI$27","v":"F1"},"E3",{"$f":"BI24","v":"E3"},{"$f":"$BI$32","v":"G1"},"F3","F2",{"$f":"$BI$27","v":"F1"},"E3","E3","E3","E3","E3","E2",{"$f":"$BI$22","v":"E1"},"D4","D4","D4","D4","D4","D4","G1","",null,null,"",{"$f":"IF(ROW(CU19)>COUNTA(CU:CU),\"\",INDEX(CU:CU,SMALL(IF(CU$2:CU$100<>\"\",ROW($2:$100)),ROW(CU19))))","v":"G1"},"G1","D2",{"$f":"Spieler!C20","v":"Suttner Magnus"},"E1",{"$f":"Spieler!N20","v":"Hofmann Frank"},{"$f":"IF(ROW(CX19)>COUNTA(CX:CX),\"\",INDEX(CX:CX,SMALL(IF(CX$2:CX$100<>\"\",ROW($2:$100)),ROW(CX19))))","v":"G1"},"G1",{"$f":"VLOOKUP(DC20,Spieler!$I$2:$J$41,2,FALSE)","v":"Löffel Ulrich"},null,null,null,"","",{"$f":"IFERROR(LARGE($DH$2:$DH$41,11),\"\")","v":458.1290042318916},"C3",null,"Hofmann Frank","C3"]
[null,null,null,null,null,null,null,null,null,null,null,null,null,null,null,null,{"$f":"IF(V21=\"\",\"\",9)","v":""},{"$f":"IF(B16=4,10,66)","v":66},"","B",{"$f":"C13","v":"B1"},{"$f":"IF(X21=\"\",\"\",D15)","v":""},{"$f":"C16","v":"B4"},{"$f":"D16","v":""},44,"Suttner Magnus","Straßburger Marko",{"$f":"Matches!O21","v":1},{"$f":"Matches!P21","v":2},null,null,0,0,0,0,0,0,null,null,null,null,null,null,null,null,null,null,null,null,null,null,null,null,null,null,null,null,"D",null,20,"D5",null,null,null,null,null,null,null,null,null,null,null,null,"F3","F2",{"$f":"$BI$27","v":"F1"},{"$f":"BI25","v":"E4"},"G2",{"$f":"$BI$32","v":"G1"},"F3","F2",{"$f":"$BI$27","v":"F1"},"E4","E4","E4","E4","E3","E2",{"$f":"$BI$22","v":"E1"},"D5","D5","D5","D5","D5","G2","",null,null,"",{"$f":"IF(ROW(CU20)>COUNTA(CU:CU),\"\",INDEX(CU:CU,SMALL(IF(CU$2:CU$100<>\"\",ROW($2:$100)),ROW(CU20))))","v":"G2"},"G2","D3",{"$f":"Spieler!C21","v":"Swennen Andy"},"G3",{"$f":"Spieler!N21","v":"Isermann Rene"},{"$f":"IF(ROW(CX20)>COUNTA(CX:CX),\"\",INDEX(CX:CX,SMALL(IF(CX$2:CX$100<>\"\",ROW($2:$100)),ROW(CX20))))","v":"G2"},"G2",{"$f":"VLOOKUP(DC21,Spieler!$I$2:$J$41,2,FALSE)","v":"Stachly Marec"},null,null,null,"","",{"$f":"IFERROR(LARGE($DH$2:$DH$41,12),\"\")","v":452.27454975065939},"E2",null,"Isermann Rene","E2"]
[null,null,null,null,null,null,null,null,null,null,null,null,null,null,null,null,{"$f":"IF(V22=\"\",\"\",10)","v":""},74,"","B",{"$f":"C14","v":"B2"},{"$f":"IF(X22=\"\",\"\",D14)","v":""},{"$f":"C17","v":"B5"},{"$f":"D17","v":""},45,"Fandrei Andreas","Delling Tino",{"$f":"Matches!O22","v":0},{"$f":"Matches!P22","v":2},null,null,0,0,0,0,0,0,null,null,null,null,null,null,null,null,null,null,null,null,null,null,null,null,null,null,null,null,"E",null,21,{"$f":"IF($CS$1=\"X\",\"\",\"E1\")","v":"E1"},null,null,null,null,null,null,null,null,null,null,null,null,null,"F3","F2",{"$f":"BI27","v":"F1"},"G3","G2",{"$f":"$BI$32","v":"G1"},"F3","F2",{"$f":"$BI$27","v":"F1"},{"$f":"$BI$27","v":"F1"},{"$f":"$BI$27","v":"F1"},{"$f":"$BI$27","v":"F1"},"E4","E3","E2",{"$f":"$BI$22","v":"E1"},{"$f":"$BI$22","v":"E1"},{"$f":"$BI$22","v":"E1"},{"$f":"$BI$22","v":"E1"},{"$f":"$BI$22","v":"E1"},"G3","E1",null,null,{"$f":"IF($CQ$1<8,\"\",IF(CS6=CR22,\"\",CR22))","v":"E1"},{"$f":"IF(ROW(CU21)>COUNTA(CU:CU),\"\",INDEX(CU:CU,SMALL(IF(CU$2:CU$100<>\"\",ROW($2:$100)),ROW(CU21))))","v":"G3"},"G3","E1",{"$f":"Spieler!C22","v":"Thomas Moritz"},"F3",{"$f":"Spieler!N22","v":"Jeroch Paul"},{"$f":"IF(ROW(CX21)>COUNTA(CX:CX),\"\",INDEX(CX:CX,SMALL(IF(CX$2:CX$100<>\"\",ROW($2:$100)),ROW(CX21))))","v":"G3"},"G3",{"$f":"VLOOKUP(DC22,Spieler!$I$2:$J$41,2,FALSE)","v":"Hofmann Frank"},null,null,null,194.31618226239877,"E1",{"$f":"IFERROR(LARGE($DH$2:$DH$41,13),\"\")","v":402.34136637226317},"B3",null,"Jeroch Paul","B3"]
["C",null,null,"Spieler","M","W","L","F+","F-","U",null,null,"Rang","Rang","P+",null,null,null,"",null,null,null,null,null,46,"Müller Marcus","Rejke Ronny",{"$f":"Matches!O23","v":2},{"$f":"Matches!P23","v":0},null,null,null,null,null,null,null,null,null,null,null,null,null,null,null,null,null,null,null,null,null,null,null,null,null,null,null,null,"F",null,22,"E2",null,null,null,null,null,null,null,null,null,null,null,null,null,null,"F3",{"$f":"BI28","v":"F2"},{"$f":"$BI$37","v":"H1"},"G3","G2",{"$f":"$BI$32","v":"G1"},"F3","F2","F2","F2","F2",{"$f":"$BI$27","v":"F1"},"E4","E3","E2","E2","E2","E2","E2","H1","E2",null,null,"E2",{"$f":"IF(ROW(CU22)>COUNTA(CU:CU),\"\",INDEX(CU:CU,SMALL(IF(CU$2:CU$100<>\"\",ROW($2:$100)),ROW(CU22))))","v":"H1"},"H1","E2",{"$f":"Spieler!C23","v":"Valderrama Salvador"},"H3",{"$f":"Spieler!N23","v":"Löffel Ulrich"},{"$f":"IF(ROW(CX22)>COUNTA(CX:CX),\"\",INDEX(CX:CX,SMALL(IF(CX$2:CX$100<>\"\",ROW($2:$100)),ROW(CX22))))","v":"H1"},"H1",{"$f":"VLOOKUP(DC23,Spieler!$I$2:$J$41,2,FALSE)","v":"Elham Faiz"},null,null,null,452.27454975065939,"E2",{"$f":"IFERROR(LARGE($DH$2:$DH$41,14),\"\")","v":382.17031657253574},"B2",null,"Löffel Ulrich","B2"]
[null,1,"C1",{"$f":"'1. Runde Gruppen'!D11","v":"Behling Oliver"},{"$f":"AJ24+AJ27+AJ30+AJ26","v":2},{"$f":"AH24+AH27+AH30+AH26","v":1},{"$f":"AI24+AI27+AI30+AI26","v":1},{"$f":"AF24+AF27+AF30+AF26","v":2},{"$f":"AG24+AG27+AG30+AG26","v":2},{"$f":"AK24+AK27+AK30+AK26","v":0},null,null,{"$f":"IF(D24=\"X\",-200000,IF(D24=\"Y\",-200000,IF(D24=\"Z\",-200000,IF(D24=\"\",-200000,IF(D24=\"Z Freilos\",-200000,IF(D24=\"\",(-90000),(F24*10000)+(H24*1000)+(J24*10)+E24-(G24*10000)-(I24*1000)+O24))))))","v":2},{"$f":"IF(E24=0,\"\",RANK(M24,M24:M28))","v":2},{"$f":"'1. Runde Gruppen'!O11","v":0},{"$f":"IF(D24=\"\",\"\",D24)","v":"Behling Oliver"},{"$f":"IF(V24=\"\",\"\",1)","v":1},3,3,"C",{"$f":"C24","v":"C1"},{"$f":"D24","v":"Behling Oliver"},{"$f":"C25","v":"C2"},{"$f":"D25","v":"Witzik Oliver"},47,"Stachly Marec","Hofmann Frank",{"$f":"Matches!O24","v":2},{"$f":"Matches!P24","v":0},null,null,{"$f":"IFERROR(VLOOKUP(S24,$Y$2:$AC$88,4,FALSE),\"\")","v":0},{"$f":"IFERROR(VLOOKUP(S24,$Y$2:$AC$88,5,FALSE),\"\")","v":2},{"$f":"IF(AF24>AG24,1,0)","v":0},{"$f":"IF(AG24>AF24,1,0)","v":1},{"$f":"IF(AF24+AG24>=1,1,0)","v":1},{"$f":"IF(AND(AF24+AG24>1,AF24=AG24),1,0)","v":0},null,null,null,null,null,null,null,null,null,null,null,null,null,null,null,null,null,null,null,null,"G",null,23,"E3",null,null,null,null,null,null,null,null,null,null,null,null,null,null,null,{"$f":"BI29","v":"F3"},"H2",{"$f":"$BI$37","v":"H1"},"G3","G2",{"$f":"$BI$32","v":"G1"},"F3","F3","F3","F3","F2",{"$f":"$BI$27","v":"F1"},"E4","E3","E3","E3","E3","E3","H2","E3",null,null,"E3",{"$f":"IF(ROW(CU23)>COUNTA(CU:CU),\"\",INDEX(CU:CU,SMALL(IF(CU$2:CU$100<>\"\",ROW($2:$100)),ROW(CU23))))","v":"H2"},"H2","E3",{"$f":"Spieler!C24","v":"Weber Marco"},"B1",{"$f":"Spieler!N24","v":"Müller Marcus"},{"$f":"IF(ROW(CX23)>COUNTA(CX:CX),\"\",INDEX(CX:CX,SMALL(IF(CX$2:CX$100<>\"\",ROW($2:$100)),ROW(CX23))))","v":"H2"},"H2",{"$f":"VLOOKUP(DC24,Spieler!$I$2:$J$41,2,FALSE)","v":"Fandrei Joel"},null,null,null,697.5277483682388,"E3",{"$f":"IFERROR(LARGE($DH$2:$DH$41,15),\"\")","v":371.07496958690092},"H1",null,"Müller Marcus","H1"]
[null,2,"C2",{"$f":"'1. Runde Gruppen'!D12","v":"Witzik Oliver"},{"$f":"AJ24+AJ29+AJ25+AJ33","v":2},{"$f":"AI24+AH25+AH29+AH33","v":2},{"$f":"AH24+AI29+AI25+AI33","v":0},{"$f":"AG24+AF33+AF29+AF25","v":4},{"$f":"AF24+AG25+AG29+AG33","v":0},{"$f":"AK24+AK29+AK25+AK33","v":0},null,null,{"$f":"IF(D25=\"X\",-200000,IF(D25=\"Y\",-200000,IF(D25=\"Z\",-200000,IF(D25=\"\",-200000,IF(D25=\"Z Freilos\",-200000,IF(D25=\"\",(-90000),(F25*10000)+(H25*1000)+(J25*10)+E25-(G25*10000)-(I25*1000)+O25))))))","v":24002},{"$f":"IF(E25=0,\"\",RANK(M25,M24:M28))","v":1},{"$f":"'1. Runde Gruppen'!O12","v":0},{"$f":"IF(D25=\"\",\"\",D25)","v":"Witzik Oliver"},{"$f":"IF(V25=\"\",\"\",2)","v":""},{"$f":"IF(B27=4,43,11)","v":11},{"$f":"IF(Q25=\"\",\"\",R25)","v":""},"C",{"$f":"C26","v":"C3"},{"$f":"IF(X25=\"\",\"\",D25)","v":""},{"$f":"C27","v":"C4"},{"$f":"D27","v":""},48,"Fandrei Joel","Thomas Moritz",{"$f":"Matches!O25","v":2},{"$f":"Matches!P25","v":1},null,null,{"$f":"IFERROR(VLOOKUP(S25,$Y$2:$AC$88,4,FALSE),\"\")","v":0},{"$f":"IFERROR(VLOOKUP(S25,$Y$2:$AC$88,5,FALSE),\"\")","v":0},0,0,{"$f":"IF(AF25+AG25>=1,1,0)","v":0},{"$f":"IF(AND(AF25+AG25>1,AF25=AG25),1,0)","v":0},null,null,null,null,null,null,null,null,null,null,null,null,null,null,null,null,null,null,null,null,"H",null,24,"E4",null,null,null,null,null,null,null,null,null,null,null,null,null,null,null,null,"H3","H2",{"$f":"$BI$37","v":"H1"},"G3","G2",{"$f":"$BI$32","v":"G1"},"F4","F4","F4","F3","F2",{"$f":"$BI$27","v":"F1"},"E4","E4","E4","E4","E4","H3","",null,null,"",{"$f":"IF(ROW(CU24)>COUNTA(CU:CU),\"\",INDEX(CU:CU,SMALL(IF(CU$2:CU$100<>\"\",ROW($2:$100)),ROW(CU24))))","v":"H3"},"H3","F1",{"$f":"Spieler!C25","v":"Witzik Oliver"},"G1",{"$f":"Spieler!N25","v":"Rejke Ronny"},{"$f":"IF(ROW(CX24)>COUNTA(CX:CX),\"\",INDEX(CX:CX,SMALL(IF(CX$2:CX$100<>\"\",ROW($2:$100)),ROW(CX24))))","v":"H3"},"H3",{"$f":"VLOOKUP(DC25,Spieler!$I$2:$J$41,2,FALSE)","v":"Thomas Moritz"},null,null,null,"","",{"$f":"IFERROR(LARGE($DH$2:$DH$41,16),\"\")","v":332.09289760510853},"D2",null,"Rejke Ronny","D2"]
[null,3,"C3",{"$f":"'1. Runde Gruppen'!D13","v":"Isermann Rene"},{"$f":"AJ27+AJ29+AJ32+AJ31","v":2},{"$f":"AI27+AI29+AH32+AH31","v":0},{"$f":"AH27+AH29+AI32+AI31","v":2},{"$f":"AG27+AG29+AF32+AF31","v":0},{"$f":"AF27+AF29+AG32+AG31","v":4},{"$f":"AK27+AK29+AK32+AK31","v":0},null,null,-23998,{"$f":"IF(E26=0,\"\",RANK(M26,M24:M28))","v":3},{"$f":"'1. Runde Gruppen'!O13","v":0},{"$f":"IF(D26=\"\",\"\",D26)","v":"Isermann Rene"},{"$f":"IF(V26=\"\",\"\",3)","v":""},19,"","C",{"$f":"C24","v":"C1"},{"$f":"IF(X26=\"\",\"\",D24)","v":""},{"$f":"C28","v":"C5"},{"$f":"D28","v":""},"","","",{"$f":"Matches!O26","v":0},{"$f":"Matches!P26","v":0},null,null,{"$f":"IFERROR(VLOOKUP(S26,$Y$2:$AC$88,4,FALSE),\"\")","v":0},0,0,0,{"$f":"IF(AF26+AG26>=1,1,0)","v":0},0,null,null,null,null,null,null,null,null,null,null,null,null,null,null,null,null,null,null,null,null,"",null,"","E5",null,null,null,null,null,null,null,null,null,null,null,null,null,null,null,null,null,"H3","H2",{"$f":"$BI$37","v":"H1"},"G3","G2",{"$f":"$BI$32","v":"G1"},{"$f":"$BI$32","v":"G1"},{"$f":"$BI$32","v":"G1"},"F4","F3","F2",{"$f":"$BI$27","v":"F1"},"E5","E5","E5","E5",0,"",null,null,"",{"$f":"IF(ROW(CU25)>COUNTA(CU:CU),\"\",INDEX(CU:CU,SMALL(IF(CU$2:CU$100<>\"\",ROW($2:$100)),ROW(CU25))))","v":{"$error":"#NUM!"}},"","F2",{"$f":"Spieler!C26","v":""},"",{"$f":"Spieler!N26","v":"Stachly Marec"},{"$f":"IF(ROW(CX25)>COUNTA(CX:CX),\"\",INDEX(CX:CX,SMALL(IF(CX$2:CX$100<>\"\",ROW($2:$100)),ROW(CX25))))","v":{"$error":"#NUM!"}},"",{"$f":"VLOOKUP(DC26,Spieler!$I$2:$J$41,2,FALSE)","v":""},null,null,null,"","",{"$f":"IFERROR(LARGE($DH$2:$DH$41,17),\"\")","v":324.5262178714633},"C2",null,"Stachly Marec","C2"]
[null,{"$f":"IF(D27=\"\",\"\",4)","v":""},"C4",{"$f":"'1. Runde Gruppen'!D14","v":""},{"$f":"AJ25+AJ28+AJ30+AJ32","v":0},{"$f":"AI25+AH28+AI30+AI32","v":0},{"$f":"AH25+AH30+AH32+AI28","v":0},{"$f":"AG25+AF28+AG30+AG32","v":0},{"$f":"AF25+AG28+AF30+AF32","v":0},{"$f":"AK25+AK30+AK32+AK28","v":0},null,null,-200000,{"$f":"IF(E27=0,\"\",RANK(M27,M24:M28))","v":""},{"$f":"'1. Runde Gruppen'!O14","v":0},{"$f":"IF(D27=\"\",\"\",D27)","v":""},{"$f":"IF(V27=\"\",\"\",4)","v":4},27,27,"C",{"$f":"C25","v":"C2"},{"$f":"D24","v":"Behling Oliver"},{"$f":"C26","v":"C3"},{"$f":"D26","v":"Isermann Rene"},"","","",{"$f":"Matches!O27","v":0},{"$f":"Matches!P27","v":0},null,null,2,0,1,0,1,0,null,null,null,null,null,null,null,null,null,null,null,null,null,null,null,null,null,null,null,null,"",null,"",{"$f":"IF($CS$1=\"X\",\"\",\"F1\")","v":"F1"},null,null,null,null,null,null,null,null,null,null,null,null,null,null,null,null,null,null,"H3","H2",{"$f":"$BI$37","v":"H1"},"G3","G2","G2","G2",{"$f":"$BI$32","v":"G1"},"F4","F3","F2",{"$f":"$BI$27","v":"F1"},{"$f":"$BI$27","v":"F1"},{"$f":"$BI$27","v":"F1"},{"$f":"$BI$27","v":"F1"},0,"F1",null,null,{"$f":"IF($CQ$1<8,\"\",IF(CS7=CR27,\"\",CR27))","v":"F1"},{"$f":"IF(ROW(CU26)>COUNTA(CU:CU),\"\",INDEX(CU:CU,SMALL(IF(CU$2:CU$100<>\"\",ROW($2:$100)),ROW(CU26))))","v":{"$error":"#NUM!"}},"","F3",{"$f":"Spieler!C27","v":""},"",{"$f":"Spieler!N27","v":"Straßburger Marko"},{"$f":"IF(ROW(CX26)>COUNTA(CX:CX),\"\",INDEX(CX:CX,SMALL(IF(CX$2:CX$100<>\"\",ROW($2:$100)),ROW(CX26))))","v":{"$error":"#NUM!"}},"",{"$f":"VLOOKUP(DC27,Spieler!$I$2:$J$41,2,FALSE)","v":""},null,null,null,217.10486349678416,"F1",{"$f":"IFERROR(LARGE($DH$2:$DH$41,18),\"\")","v":217.10486349678416},"F1",null,"Straßburger Marko","F1"]
[null,{"$f":"IF(D28=\"\",\"\",5)","v":""},"C5",{"$f":"'1. Runde Gruppen'!D15","v":""},{"$f":"AJ26+AJ28+AJ31+AJ33","v":0},{"$f":"AI26+AI28+AI31+AI33","v":0},{"$f":"AH26+AH28+AH31+AH33","v":0},{"$f":"AG26+AG28+AG31+AG33","v":0},{"$f":"AF26+AF28+AF31+AF33","v":0},{"$f":"AK26+AK28+AK31+AK33","v":0},null,null,-200000,{"$f":"IF(E28=0,\"\",RANK(M28,M24:M28))","v":""},{"$f":"'1. Runde Gruppen'!O15","v":0},{"$f":"IF(D28=\"\",\"\",D28)","v":""},{"$f":"IF(V28=\"\",\"\",5)","v":""},35,"","C",{"$f":"C27","v":"C4"},{"$f":"IF(X28=\"\",\"\",D27)","v":""},{"$f":"C28","v":"C5"},{"$f":"D28","v":""},{"$f":"IFERROR(SMALL($S$2:$S$88,ROW()-1),\"\")","v":""},"","",{"$f":"Matches!O28","v":0},{"$f":"Matches!P28","v":0},null,null,0,0,0,0,0,0,null,null,null,null,null,null,null,null,null,null,null,null,null,null,null,null,null,null,null,null,"",null,"","F2",null,null,null,null,null,null,null,null,null,null,null,null,null,null,null,null,null,null,null,"H3","H2",{"$f":"$BI$37","v":"H1"},"G3","G3","G3","G2",{"$f":"$BI$32","v":"G1"},"F4","F3","F2","F2","F2","F2",0,"F2",null,null,"F2",{"$f":"IF(ROW(CU27)>COUNTA(CU:CU),\"\",INDEX(CU:CU,SMALL(IF(CU$2:CU$100<>\"\",ROW($2:$100)),ROW(CU27))))","v":{"$error":"#NUM!"}},"","G1",{"$f":"Spieler!C28","v":""},"",{"$f":"Spieler!N28","v":"Suttner Magnus"},{"$f":"IF(ROW(CX27)>COUNTA(CX:CX),\"\",INDEX(CX:CX,SMALL(IF(CX$2:CX$100<>\"\",ROW($2:$100)),ROW(CX27))))","v":{"$error":"#NUM!"}},"",{"$f":"VLOOKUP(DC28,Spieler!$I$2:$J$41,2,FALSE)","v":""},null,null,null,784.74592576861824,"F2",{"$f":"IFERROR(LARGE($DH$2:$DH$41,19),\"\")","v":194.31618226239877},"E1",null,"Suttner Magnus","E1"]
[null,null,null,null,null,null,null,null,null,null,null,null,null,null,null,null,{"$f":"IF(V29=\"\",\"\",6)","v":6},{"$f":"IF(B27=4,67,43)","v":43},43,"C",{"$f":"C24","v":"C1"},{"$f":"D25","v":"Witzik Oliver"},{"$f":"C26","v":"C3"},"Isermann Rene","","","",{"$f":"Matches!O29","v":0},{"$f":"Matches!P29","v":0},null,null,2,0,1,0,1,0,null,null,null,null,null,null,null,null,null,null,null,null,null,null,null,null,null,null,null,null,"",null,"","F3",null,null,null,null,null,null,null,null,null,null,null,null,null,null,null,null,null,null,null,null,"H3","H2",{"$f":"$BI$37","v":"H1"},"G4","G4","G3","G2",{"$f":"$BI$32","v":"G1"},"F4","F3","F3","F3","F3",0,"F3",null,null,"F3",{"$f":"IF(ROW(CU28)>COUNTA(CU:CU),\"\",INDEX(CU:CU,SMALL(IF(CU$2:CU$100<>\"\",ROW($2:$100)),ROW(CU28))))","v":{"$error":"#NUM!"}},"","G2",{"$f":"Spieler!C29","v":""},"",{"$f":"Spieler!N29","v":"Swennen Andy"},{"$f":"IF(ROW(CX28)>COUNTA(CX:CX),\"\",INDEX(CX:CX,SMALL(IF(CX$2:CX$100<>\"\",ROW($2:$100)),ROW(CX28))))","v":{"$error":"#NUM!"}},"",{"$f":"VLOOKUP(DC29,Spieler!$I$2:$J$41,2,FALSE)","v":""},null,null,null,71.981690893582197,"F3",{"$f":"IFERROR(LARGE($DH$2:$DH$41,20),\"\")","v":126.56513935807368},"G3",null,"Swennen Andy","G3"]
[null,null,null,null,null,null,null,null,null,null,null,null,null,null,null,null,{"$f":"IF(V30=\"\",\"\",7)","v":""},51,"","C",{"$f":"C25","v":"C2"},{"$f":"IF(X30=\"\",\"\",D24)","v":""},"C4","","","","",{"$f":"Matches!O30","v":0},{"$f":"Matches!P30","v":0},null,null,0,0,0,0,0,0,null,null,null,null,null,null,null,null,null,null,null,null,null,null,null,null,null,null,null,null,"",null,"","F4",null,null,null,null,null,null,null,null,null,null,null,null,null,null,null,null,null,null,null,null,null,"H3","H2",{"$f":"$BI$37","v":"H1"},{"$f":"$BI$37","v":"H1"},"G4","G3","G2",{"$f":"$BI$32","v":"G1"},"F4","F4","F4","F4",0,{"$f":"CS72","v":""},null,null,{"$f":"IF($CQ$1<8,\"\",IF(CS30=CR30,\"\",CR30))","v":""},{"$f":"IF(ROW(CU29)>COUNTA(CU:CU),\"\",INDEX(CU:CU,SMALL(IF(CU$2:CU$100<>\"\",ROW($2:$100)),ROW(CU29))))","v":{"$error":"#NUM!"}},"","G3",{"$f":"Spieler!C30","v":""},"",{"$f":"Spieler!N30","v":"Thomas Moritz"},{"$f":"IF(ROW(CX29)>COUNTA(CX:CX),\"\",INDEX(CX:CX,SMALL(IF(CX$2:CX$100<>\"\",ROW($2:$100)),ROW(CX29))))","v":{"$error":"#NUM!"}},"",{"$f":"VLOOKUP(DC30,Spieler!$I$2:$J$41,2,FALSE)","v":""},null,null,null,"","",{"$f":"IFERROR(LARGE($DH$2:$DH$41,21),\"\")","v":71.981690893582197},"F3",null,"Thomas Moritz","F3"]
[null,null,null,null,null,null,null,null,null,null,null,null,null,null,null,null,{"$f":"IF(V31=\"\",\"\",8)","v":""},59,"","C",{"$f":"C26","v":"C3"},{"$f":"IF(X31=\"\",\"\",D26)","v":""},"C5","","","","",{"$f":"Matches!O31","v":0},{"$f":"Matches!P31","v":0},null,null,0,0,0,0,0,0,null,null,null,null,null,null,null,null,null,null,null,null,null,null,null,null,null,null,null,null,"",null,"","F5",null,null,null,null,null,null,null,null,null,null,null,null,null,null,null,null,null,null,null,null,null,null,"H3","H2","H2",{"$f":"$BI$37","v":"H1"},"G4","G3","G2",{"$f":"$BI$32","v":"G1"},"F5","F5","F5",0,"",null,null,"",{"$f":"IF(ROW(CU30)>COUNTA(CU:CU),\"\",INDEX(CU:CU,SMALL(IF(CU$2:CU$100<>\"\",ROW($2:$100)),ROW(CU30))))","v":{"$error":"#NUM!"}},"","H1",{"$f":"Spieler!C31","v":""},"",{"$f":"Spieler!N31","v":"Valderrama Salvador"},{"$f":"IF(ROW(CX30)>COUNTA(CX:CX),\"\",INDEX(CX:CX,SMALL(IF(CX$2:CX$100<>\"\",ROW($2:$100)),ROW(CX30))))","v":{"$error":"#NUM!"}},"",{"$f":"VLOOKUP(DC31,Spieler!$I$2:$J$41,2,FALSE)","v":""},null,null,null,"","",{"$f":"IFERROR(LARGE($DH$2:$DH$41,22),\"\")","v":68.082899586868976},"H3",null,"Valderrama Salvador","H3"]
[null,null,null,null,null,null,null,null,null,null,null,null,null,null,null,null,{"$f":"IF(V32=\"\",\"\",9)","v":""},{"$f":"IF(B27=4,11,67)","v":67},"","C",{"$f":"C24","v":"C1"},{"$f":"IF(X32=\"\",\"\",D26)","v":""},{"$f":"C27","v":"C4"},{"$f":"D27","v":""},"","","",{"$f":"Matches!O32","v":0},{"$f":"Matches!P32","v":0},null,null,0,0,0,0,0,0,null,null,null,null,null,null,null,null,null,null,null,null,null,null,null,null,null,null,null,null,"",null,"",{"$f":"IF($CS$1=\"X\",\"\",\"G1\")","v":"G1"},null,null,null,null,null,null,null,null,null,null,null,null,null,null,null,null,null,null,null,null,null,null,null,"H3","H3","H2",{"$f":"$BI$37","v":"H1"},"G4","G3","G2",{"$f":"$BI$32","v":"G1"},{"$f":"$BI$32","v":"G1"},{"$f":"$BI$32","v":"G1"},0,"G1",null,null,{"$f":"IF($CQ$1<8,\"\",IF(CS8=CR32,\"\",CR32))","v":"G1"},{"$f":"IF(ROW(CU31)>COUNTA(CU:CU),\"\",INDEX(CU:CU,SMALL(IF(CU$2:CU$100<>\"\",ROW($2:$100)),ROW(CU31))))","v":{"$error":"#NUM!"}},"","H2",{"$f":"Spieler!C32","v":""},"",{"$f":"Spieler!N32","v":"Weber Marco"},{"$f":"IF(ROW(CX31)>COUNTA(CX:CX),\"\",INDEX(CX:CX,SMALL(IF(CX$2:CX$100<>\"\",ROW($2:$100)),ROW(CX31))))","v":{"$error":"#NUM!"}},"",{"$f":"VLOOKUP(DC32,Spieler!$I$2:$J$41,2,FALSE)","v":""},null,null,null,19.428256003854671,"G1",{"$f":"IFERROR(LARGE($DH$2:$DH$41,23),\"\")","v":29.113463341337244},"B1",null,"Weber Marco","B1"]
[null,null,null,null,null,null,null,null,null,null,null,null,null,null,null,null,{"$f":"IF(V33=\"\",\"\",10)","v":""},75,"","C",{"$f":"C25","v":"C2"},{"$f":"IF(X33=\"\",\"\",D25)","v":""},{"$f":"C28","v":"C5"},{"$f":"D28","v":""},"","","",{"$f":"Matches!O33","v":0},{"$f":"Matches!P33","v":0},null,null,0,0,0,0,0,0,null,null,null,null,null,null,null,null,null,null,null,null,null,null,null,null,null,null,null,null,"",null,"","G2",null,null,null,null,null,null,null,null,null,null,null,null,null,null,null,null,null,null,null,null,null,null,null,null,"H4","H3","H2",{"$f":"$BI$37","v":"H1"},"G4","G3","G2","G2","G2",0,"G2",null,null,{"$f":"IF($CQ$1<8,\"\",IF(CS8=CR33,\"\",CR33))","v":"G2"},{"$f":"IF(ROW(CU32)>COUNTA(CU:CU),\"\",INDEX(CU:CU,SMALL(IF(CU$2:CU$100<>\"\",ROW($2:$100)),ROW(CU32))))","v":{"$error":"#NUM!"}},"","H3",{"$f":"Spieler!C33","v":""},"",{"$f":"Spieler!N33","v":"Witzik Oliver"},{"$f":"IF(ROW(CX32)>COUNTA(CX:CX),\"\",INDEX(CX:CX,SMALL(IF(CX$2:CX$100<>\"\",ROW($2:$100)),ROW(CX32))))","v":{"$error":"#NUM!"}},{"$f":"IFERROR(IF(DB33>\"\",DB33,\"\"),\"\")","v":""},{"$f":"VLOOKUP(DC33,Spieler!$I$2:$J$41,2,FALSE)","v":""},null,null,null,905.14395872358216,"G2",{"$f":"IFERROR(LARGE($DH$2:$DH$41,24),\"\")","v":19.428256003854671},"G1",null,"Witzik Oliver","G1"]
["D",null,null,"Spieler","M","W","L","F+","F-","U",null,null,"Rang","Rang","P+",null,null,null,"",null,null,null,null,null,"","","",{"$f":"Matches!O34","v":0},{"$f":"Matches!P34","v":0},null,null,null,null,null,null,null,null,null,null,null,null,null,null,null,null,null,null,null,null,null,null,null,null,null,null,null,null,"",null,"","G3",null,null,null,null,null,null,null,null,null,null,null,null,null,null,null,null,null,null,null,null,null,null,null,null,null,"H4","H3","H2",{"$f":"$BI$37","v":"H1"},"G4","G3","G3","G3",0,"G3",null,null,"G3",{"$f":"IF(ROW(CU33)>COUNTA(CU:CU),\"\",INDEX(CU:CU,SMALL(IF(CU$2:CU$100<>\"\",ROW($2:$100)),ROW(CU33))))","v":{"$error":"#NUM!"}},"","",{"$f":"Spieler!C34","v":""},"",{"$f":"Spieler!N34","v":""},{"$f":"IF(ROW(CX33)>COUNTA(CX:CX),\"\",INDEX(CX:CX,SMALL(IF(CX$2:CX$100<>\"\",ROW($2:$100)),ROW(CX33))))","v":{"$error":"#NUM!"}},"",{"$f":"VLOOKUP(DC34,Spieler!$I$2:$J$41,2,FALSE)","v":""},null,null,null,126.56513935807368,"G3",{"$f":"IFERROR(LARGE($DH$2:$DH$41,25),\"\")","v":""},"",null,"",""]
[null,1,"D1",{"$f":"'1. Runde Gruppen'!T11","v":"Hartung Andreas"},{"$f":"AJ35+AJ38+AJ41+AJ37","v":2},{"$f":"AH35+AH38+AH41+AH37","v":0},{"$f":"AI35+AI38+AI41+AI37","v":2},{"$f":"AF35+AF38+AF41+AF37","v":1},{"$f":"AG35+AG38+AG41+AG37","v":4},{"$f":"AK35+AK38+AK41+AK37","v":0},null,null,{"$f":"IF(D35=\"X\",-200000,IF(D35=\"Y\",-200000,IF(D35=\"Z\",-200000,IF(D35=\"\",-200000,IF(D35=\"Z Freilos\",-200000,IF(D35=\"\",(-90000),(F35*10000)+(H35*1000)+(J35*10)+E35-(G35*10000)-(I35*1000)+O35))))))","v":-22998},{"$f":"IF(E35=0,\"\",RANK(M35,M35:M39))","v":3},{"$f":"'1. Runde Gruppen'!AE11","v":0},{"$f":"IF(D35=\"\",\"\",D35)","v":"Hartung Andreas"},{"$f":"IF(V35=\"\",\"\",1)","v":1},4,4,"D",{"$f":"C35","v":"D1"},{"$f":"D35","v":"Hartung Andreas"},{"$f":"C36","v":"D2"},{"$f":"D36","v":"Suttner Magnus"},"","","",{"$f":"Matches!O35","v":0},{"$f":"Matches!P35","v":0},null,null,{"$f":"VLOOKUP(S35,$Y$2:$AC$88,4,FALSE)","v":0},{"$f":"VLOOKUP(S35,$Y$2:$AC$88,5,FALSE)","v":2},{"$f":"IF(AF35>AG35,1,0)","v":0},{"$f":"IF(AG35>AF35,1,0)","v":1},{"$f":"IF(AF35+AG35>=1,1,0)","v":1},{"$f":"IF(AND(AF35+AG35>1,AF35=AG35),1,0)","v":0},null,null,null,null,null,null,null,null,null,null,null,null,null,null,null,null,null,null,null,null,"",null,"","G4",null,null,null,null,null,null,null,null,null,null,null,null,null,null,null,null,null,null,null,null,null,null,null,null,null,null,"H4","H3","H2",{"$f":"$BI$37","v":"H1"},"G4","G4","G4",0,"",null,null,"",{"$f":"IF(ROW(CU34)>COUNTA(CU:CU),\"\",INDEX(CU:CU,SMALL(IF(CU$2:CU$100<>\"\",ROW($2:$100)),ROW(CU34))))","v":{"$error":"#NUM!"}},"","",{"$f":"Spieler!C35","v":""},"",{"$f":"Spieler!N35","v":""},{"$f":"IF(ROW(CX34)>COUNTA(CX:CX),\"\",INDEX(CX:CX,SMALL(IF(CX$2:CX$100<>\"\",ROW($2:$100)),ROW(CX34))))","v":{"$error":"#NUM!"}},"",{"$f":"VLOOKUP(DC35,Spieler!$I$2:$J$41,2,FALSE)","v":""},null,null,null,"","",{"$f":"IFERROR(LARGE($DH$2:$DH$41,26),\"\")","v":""},"",null,"",""]
[null,2,"D2",{"$f":"'1. Runde Gruppen'!T12","v":"Suttner Magnus"},{"$f":"AJ35+AJ40+AJ36+AJ44","v":2},{"$f":"AI35+AH36+AH40+AH44","v":1},{"$f":"AH35+AI40+AI36+AI44","v":1},{"$f":"AG35+AF44+AF40+AF36","v":3},{"$f":"AF35+AG36+AG40+AG44","v":2},{"$f":"AK35+AK40+AK36+AK44","v":0},null,null,{"$f":"IF(D36=\"X\",-200000,IF(D36=\"Y\",-200000,IF(D36=\"Z\",-200000,IF(D36=\"\",-200000,IF(D36=\"Z Freilos\",-200000,IF(D36=\"\",(-90000),(F36*10000)+(H36*1000)+(J36*10)+E36-(G36*10000)-(I36*1000)+O36))))))","v":1002},{"$f":"IF(E36=0,\"\",RANK(M36,M35:M39))","v":2},{"$f":"'1. Runde Gruppen'!AE12","v":0},{"$f":"IF(D36=\"\",\"\",D36)","v":"Suttner Magnus"},{"$f":"IF(V36=\"\",\"\",2)","v":""},{"$f":"IF(B38=4,44,12)","v":12},"","D",{"$f":"C37","v":"D3"},{"$f":"IF(X36=\"\",\"\",D36)","v":""},{"$f":"C38","v":"D4"},{"$f":"D38","v":""},"","","",{"$f":"Matches!O36","v":0},{"$f":"Matches!P36","v":0},null,null,{"$f":"VLOOKUP(S36,$Y$2:$AC$88,4,FALSE)","v":0},{"$f":"VLOOKUP(S36,$Y$2:$AC$88,5,FALSE)","v":0},0,0,{"$f":"IF(AF36+AG36>=1,1,0)","v":0},{"$f":"IF(AND(AF36+AG36>1,AF36=AG36),1,0)","v":0},null,null,null,null,null,null,null,null,null,null,null,null,null,null,null,null,null,null,null,null,"",null,"","G5",null,null,null,null,null,null,null,null,null,null,null,null,null,null,null,null,null,null,null,null,null,null,null,null,null,null,null,"H4","H3","H2",{"$f":"$BI$37","v":"H1"},"G5","G5",0,"",null,null,"",{"$f":"IF(ROW(CU35)>COUNTA(CU:CU),\"\",INDEX(CU:CU,SMALL(IF(CU$2:CU$100<>\"\",ROW($2:$100)),ROW(CU35))))","v":{"$error":"#NUM!"}},"","",{"$f":"Spieler!C36","v":""},"",{"$f":"Spieler!N36","v":""},{"$f":"IF(ROW(CX35)>COUNTA(CX:CX),\"\",INDEX(CX:CX,SMALL(IF(CX$2:CX$100<>\"\",ROW($2:$100)),ROW(CX35))))","v":{"$error":"#NUM!"}},"",{"$f":"VLOOKUP(DC36,Spieler!$I$2:$J$41,2,FALSE)","v":""},null,null,null,"","",{"$f":"IFERROR(LARGE($DH$2:$DH$41,27),\"\")","v":""},"",null,"",""]
[null,3,"D3",{"$f":"'1. Runde Gruppen'!T13","v":"Straßburger Marko"},{"$f":"AJ38+AJ40+AJ43+AJ42","v":2},{"$f":"AI38+AI40+AH43+AH42","v":2},{"$f":"AH38+AH40+AI43+AI42","v":0},{"$f":"AG38+AG40+AF43+AF42","v":4},{"$f":"AF38+AF40+AG43+AG42","v":2},{"$f":"AK38+AK40+AK43+AK42","v":0},null,null,22002,{"$f":"IF(E37=0,\"\",RANK(M37,M35:M39))","v":1},{"$f":"'1. Runde Gruppen'!AE13","v":0},{"$f":"IF(D37=\"\",\"\",D37)","v":"Straßburger Marko"},{"$f":"IF(V37=\"\",\"\",3)","v":""},20,"","D",{"$f":"C35","v":"D1"},{"$f":"IF(X37=\"\",\"\",D35)","v":""},{"$f":"C39","v":"D5"},{"$f":"D39","v":""},"","","",{"$f":"Matches!O37","v":0},{"$f":"Matches!P37","v":0},null,null,0,0,0,0,{"$f":"IF(AF37+AG37>=1,1,0)","v":0},0,null,null,null,null,null,null,null,null,null,null,null,null,null,null,null,null,null,null,null,null,"",null,"",{"$f":"IF($CS$1=\"X\",\"\",\"H1\")","v":"H1"},null,null,null,null,null,null,null,null,null,null,null,null,null,null,null,null,null,null,null,null,null,null,null,null,null,null,null,null,"H4","H3","H2",{"$f":"$BI$37","v":"H1"},{"$f":"$BI$37","v":"H1"},0,"H1",null,null,{"$f":"IF($CQ$1<8,\"\",IF(CS9=CR37,\"\",CR37))","v":"H1"},{"$f":"IF(ROW(CU36)>COUNTA(CU:CU),\"\",INDEX(CU:CU,SMALL(IF(CU$2:CU$100<>\"\",ROW($2:$100)),ROW(CU36))))","v":{"$error":"#NUM!"}},"","",{"$f":"Spieler!C37","v":""},"",{"$f":"Spieler!N37","v":""},{"$f":"IF(ROW(CX36)>COUNTA(CX:CX),\"\",INDEX(CX:CX,SMALL(IF(CX$2:CX$100<>\"\",ROW($2:$100)),ROW(CX36))))","v":{"$error":"#NUM!"}},"",{"$f":"VLOOKUP(DC37,Spieler!$I$2:$J$41,2,FALSE)","v":""},null,null,null,371.07496958690092,"H1",{"$f":"IFERROR(LARGE($DH$2:$DH$41,28),\"\")","v":""},"",null,"",""]
[null,{"$f":"IF(D38=\"\",\"\",4)","v":""},"D4",{"$f":"'1. Runde Gruppen'!T14","v":""},{"$f":"AJ36+AJ39+AJ41+AJ43","v":0},{"$f":"AI36+AH39+AI41+AI43","v":0},{"$f":"AH36+AH41+AH43+AI39","v":0},{"$f":"AG36+AF39+AG41+AG43","v":0},{"$f":"AF36+AG39+AF41+AF43","v":0},{"$f":"AK36+AK41+AK43+AK39","v":0},null,null,-200000,{"$f":"IF(E38=0,\"\",RANK(M38,M35:M39))","v":""},{"$f":"'1. Runde Gruppen'!AE14","v":0},{"$f":"IF(D38=\"\",\"\",D38)","v":""},{"$f":"IF(V38=\"\",\"\",4)","v":4},28,28,"D",{"$f":"C36","v":"D2"},{"$f":"D35","v":"Hartung Andreas"},{"$f":"C37","v":"D3"},{"$f":"D37","v":"Straßburger Marko"},"","","",{"$f":"Matches!O38","v":0},{"$f":"Matches!P38","v":0},null,null,1,2,0,1,1,0,null,null,null,null,null,null,null,null,null,null,null,null,null,null,null,null,null,null,null,null,"",null,"","H2",null,null,null,null,null,null,null,null,null,null,null,null,null,null,null,null,null,null,null,null,null,null,null,null,null,null,null,null,null,"H4","H3","H2","H2",0,"H2",null,null,{"$f":"IF($CQ$1<8,\"\",IF(CS38=CR38,\"\",CR38))","v":"H2"},{"$f":"IF(ROW(CU37)>COUNTA(CU:CU),\"\",INDEX(CU:CU,SMALL(IF(CU$2:CU$100<>\"\",ROW($2:$100)),ROW(CU37))))","v":{"$error":"#NUM!"}},"","",{"$f":"Spieler!C38","v":""},"",{"$f":"Spieler!N38","v":""},{"$f":"IF(ROW(CX37)>COUNTA(CX:CX),\"\",INDEX(CX:CX,SMALL(IF(CX$2:CX$100<>\"\",ROW($2:$100)),ROW(CX37))))","v":{"$error":"#NUM!"}},"",{"$f":"VLOOKUP(DC38,Spieler!$I$2:$J$41,2,FALSE)","v":""},null,null,null,725.42227540397676,"H2",{"$f":"IFERROR(LARGE($DH$2:$DH$41,29),\"\")","v":""},"",null,"",""]
[null,{"$f":"IF(D39=\"\",\"\",5)","v":""},"D5",{"$f":"'1. Runde Gruppen'!T15","v":""},{"$f":"AJ37+AJ39+AJ42+AJ44","v":0},{"$f":"AI37+AI39+AI42+AI44","v":0},{"$f":"AH37+AH39+AH42+AH44","v":0},{"$f":"AG37+AG39+AG42+AG44","v":0},{"$f":"AF37+AF39+AF42+AF44","v":0},{"$f":"AK37+AK39+AK42+AK44","v":0},null,null,-200000,{"$f":"IF(E39=0,\"\",RANK(M39,M35:M39))","v":""},{"$f":"'1. Runde Gruppen'!AE15","v":0},{"$f":"IF(D39=\"\",\"\",D39)","v":""},{"$f":"IF(V39=\"\",\"\",5)","v":""},36,"","D",{"$f":"C38","v":"D4"},{"$f":"IF(X39=\"\",\"\",D38)","v":""},{"$f":"C39","v":"D5"},{"$f":"D39","v":""},"","","",{"$f":"Matches!O39","v":0},{"$f":"Matches!P39","v":0},null,null,0,0,0,0,0,0,null,null,null,null,null,null,null,null,null,null,null,null,null,null,null,null,null,null,null,null,"",null,"","H3",null,null,null,null,null,null,null,null,null,null,null,null,null,null,null,null,null,null,null,null,null,null,null,null,null,null,null,null,null,null,"H4","H3","H3",0,"H3",null,null,{"$f":"IF($CQ$1<8,\"\",IF(CS39=CR39,\"\",CR39))","v":"H3"},{"$f":"IF(ROW(CU38)>COUNTA(CU:CU),\"\",INDEX(CU:CU,SMALL(IF(CU$2:CU$100<>\"\",ROW($2:$100)),ROW(CU38))))","v":{"$error":"#NUM!"}},"","",{"$f":"Spieler!C39","v":""},{"$f":"VLOOKUP(CY39,$DM$2:$DN$49,2,FALSE)","v":""},{"$f":"Spieler!N39","v":""},{"$f":"IF(ROW(CX38)>COUNTA(CX:CX),\"\",INDEX(CX:CX,SMALL(IF(CX$2:CX$100<>\"\",ROW($2:$100)),ROW(CX38))))","v":{"$error":"#NUM!"}},"",{"$f":"VLOOKUP(DC39,Spieler!$I$2:$J$41,2,FALSE)","v":""},null,null,null,68.082899586868976,"H3",{"$f":"IFERROR(LARGE($DH$2:$DH$41,30),\"\")","v":""},"",null,"",""]
[null,null,null,null,null,null,null,null,null,null,null,null,null,null,null,null,{"$f":"IF(V40=\"\",\"\",6)","v":6},{"$f":"IF(B38=4,68,44)","v":44},44,"D",{"$f":"C35","v":"D1"},{"$f":"D36","v":"Suttner Magnus"},{"$f":"C37","v":"D3"},"Straßburger Marko","","","",{"$f":"Matches!O40","v":0},{"$f":"Matches!P40","v":0},null,null,1,2,0,1,1,0,null,null,null,null,null,null,null,null,null,null,null,null,null,null,null,null,null,null,null,null,"",null,"","H4",null,null,null,null,null,null,null,null,null,null,null,null,null,null,null,null,null,null,null,null,null,null,null,null,null,null,null,null,null,null,null,"H4","H4",0,"",null,null,"",{"$f":"IF(ROW(CU39)>COUNTA(CU:CU),\"\",INDEX(CU:CU,SMALL(IF(CU$2:CU$100<>\"\",ROW($2:$100)),ROW(CU39))))","v":{"$error":"#NUM!"}},"","",{"$f":"Spieler!C40","v":""},"",{"$f":"Spieler!N40","v":""},{"$f":"IF(ROW(CX39)>COUNTA(CX:CX),\"\",INDEX(CX:CX,SMALL(IF(CX$2:CX$100<>\"\",ROW($2:$100)),ROW(CX39))))","v":{"$error":"#NUM!"}},"",{"$f":"VLOOKUP(DC40,Spieler!$I$2:$J$41,2,FALSE)","v":""},null,null,null,"","",{"$f":"IFERROR(LARGE($DH$2:$DH$41,31),\"\")","v":""},"",null,"",""]
[null,null,null,null,null,null,null,null,null,null,null,null,null,null,null,null,{"$f":"IF(V41=\"\",\"\",7)","v":""},52,"","D",{"$f":"C36","v":"D2"},{"$f":"IF(X41=\"\",\"\",D35)","v":""},"D4","","","","",{"$f":"Matches!O41","v":0},{"$f":"Matches!P41","v":0},null,null,0,0,0,0,0,0,null,null,null,null,null,null,null,null,null,null,null,null,null,null,null,null,null,null,null,null,"",null,"","H5",null,null,null,null,null,null,null,null,null,null,null,null,null,null,null,null,null,null,null,null,null,null,null,null,null,null,null,null,null,null,null,null,"H5",0,"",null,null,"",{"$f":"IF(ROW(CU40)>COUNTA(CU:CU),\"\",INDEX(CU:CU,SMALL(IF(CU$2:CU$100<>\"\",ROW($2:$100)),ROW(CU40))))","v":{"$error":"#NUM!"}},"","",{"$f":"Spieler!C41","v":""},"",{"$f":"Spieler!N41","v":""},{"$f":"IF(ROW(CX40)>COUNTA(CX:CX),\"\",INDEX(CX:CX,SMALL(IF(CX$2:CX$100<>\"\",ROW($2:$100)),ROW(CX40))))","v":{"$error":"#NUM!"}},"",{"$f":"VLOOKUP(DC41,Spieler!$I$2:$J$41,2,FALSE)","v":""},null,null,null,"","",{"$f":"IFERROR(LARGE($DH$2:$DH$41,32),\"\")","v":""},"",null,"",""]
[null,null,null,null,null,null,null,null,null,null,null,null,null,null,null,null,{"$f":"IF(V42=\"\",\"\",8)","v":""},60,"","D",{"$f":"C37","v":"D3"},{"$f":"IF(X42=\"\",\"\",D37)","v":""},"D5","","","","",{"$f":"Matches!O42","v":0},{"$f":"Matches!P42","v":0},null,null,0,0,0,0,0,0,null,null,null,null,null,null,null,null,null,null,null,null,null,null,null,null,null,null,null,null,"",null,"",null,null,null,null,null,null,null,null,null,null,null,null,null,{"$f":"IF(AND(Spieler!AG1=\"X\",CQ43=24),\"X\",IF(CQ43<21,Spieler!AG1,\"\"))","v":"X"},null,null,null,null,null,null,null,null,null,null,null,null,null,null,null,null,null,null,null,null,null,null,null,null,null,null,null,"",null,null,{"$f":"Spieler!N42","v":""},null,null,null,null,null,null,null,null,{"$f":"IFERROR(LARGE($DH$2:$DH$41,33),\"\")","v":""},"",null,{"$f":"DA42","v":""},""]
[null,null,null,null,null,null,null,null,null,null,null,null,null,null,null,null,{"$f":"IF(V43=\"\",\"\",9)","v":""},{"$f":"IF(B38=4,12,68)","v":68},"","D",{"$f":"C35","v":"D1"},{"$f":"IF(X43=\"\",\"\",D37)","v":""},{"$f":"C38","v":"D4"},{"$f":"D38","v":""},"","","",{"$f":"Matches!O43","v":0},{"$f":"Matches!P43","v":0},null,null,0,0,0,0,0,0,null,null,null,null,null,null,null,null,null,null,null,null,null,null,null,null,null,null,null,null,"",null,"",{"$f":"AW43","v":0},8,9,10,11,12,13,14,15,16,17,18,19,20,21,22,23,24,25,26,27,28,29,30,31,32,33,34,35,36,37,38,39,40,{"$f":"BH1","v":24},null,null,null,null,null,null,"",null,null,{"$f":"Spieler!N43","v":""},null,null,null,null,null,null,null,null,{"$f":"IFERROR(LARGE($DH$2:$DH$41,34),\"\")","v":""},"",null,"",""]
[null,null,null,null,null,null,null,null,null,null,null,null,null,null,null,null,{"$f":"IF(V44=\"\",\"\",10)","v":""},76,"","D",{"$f":"C36","v":"D2"},{"$f":"IF(X44=\"\",\"\",D36)","v":""},{"$f":"C39","v":"D5"},{"$f":"D39","v":""},"","","",{"$f":"Matches!O44","v":0},{"$f":"Matches!P44","v":0},null,null,{"$f":"VLOOKUP(S44,$Y$2:$AC$88,4,FALSE)","v":0},{"$f":"VLOOKUP(S44,$Y$2:$AC$88,5,FALSE)","v":0},0,0,0,0,null,null,null,null,null,null,null,null,null,null,null,null,null,null,null,null,null,null,null,null,"",null,"","A1","A1","A1","A1","A1","A1","A1","A1","A1","A1","A1","A1","A1","A1","A1","A1","A1","A1","A1","A1","A1","A1","A1","A1","A1","A1","A1","A1","A1","A1","A1","A1","A1","A1",{"$f":"IFERROR(LOOKUP($CQ$1,$BI$1:$CP$1,BI44:CP44),\"\")","v":"A1"},null,{"$f":"IF(CQ44=0,\"\",CQ44)","v":"A1"},{"$f":"IF(ROW(CS43)>COUNTA(CS43:CS100),\"\",INDEX(CS43:CS100,SMALL(IF(CS$43:CS$100<>\"\",ROW($43:$100)),ROW(CS43))))","v":""},null,null,null,"",null,null,{"$f":"Spieler!N44","v":""},null,null,null,null,null,null,null,null,{"$f":"IFERROR(LARGE($DH$2:$DH$41,35),\"\")","v":""},"",null,"",""]
["E",null,null,"Spieler","M","W","L","F+","F-","U",null,null,"Rang","Rang","P+",null,null,null,"",null,null,null,null,null,"","","",{"$f":"Matches!O45","v":0},{"$f":"Matches!P45","v":0},null,null,null,null,null,null,null,null,null,null,null,null,null,null,null,null,null,null,null,null,null,null,null,null,null,null,null,null,"",null,"","A2","A2","A2","A2","A2","A2","A2","A2","A2","A2","A2","A2","A2","A2","A2","A2","A2","A2","A2","A2","A2","A2","A2","A2","A2","A2","A2","A2","A2","A2","A2","A2","A2","A2",{"$f":"IFERROR(LOOKUP($CQ$1,$BI$1:$CP$1,BI45:CP45),\"\")","v":"A2"},null,{"$f":"IF(CQ45=0,\"\",CQ45)","v":"A2"},{"$f":"IF(ROW(CS44)>COUNTA(CS44:CS101),\"\",INDEX(CS44:CS101,SMALL(IF(CS$43:CS$100<>\"\",ROW($43:$100)),ROW(CS44))))","v":""},null,null,null,"",null,null,{"$f":"Spieler!N45","v":""},null,null,null,null,null,null,null,null,{"$f":"IFERROR(LARGE($DH$2:$DH$41,36),\"\")","v":""},"",null,"",""]
[null,1,"E1",{"$f":"'1. Runde Gruppen'!D19","v":"Swennen Andy"},{"$f":"AJ46+AJ49+AJ52+AJ48","v":2},{"$f":"AH46+AH49+AH52+AH48","v":0},{"$f":"AI46+AI49+AI52+AI48","v":2},{"$f":"AF46+AF49+AF52+AF48","v":0},{"$f":"AG46+AG49+AG52+AG48","v":4},{"$f":"AK46+AK49+AK52+AK48","v":0},null,null,{"$f":"IF(D46=\"X\",-200000,IF(D46=\"Y\",-200000,IF(D46=\"Z\",-200000,IF(D46=\"\",-200000,IF(D46=\"Z Freilos\",-200000,IF(D46=\"\",(-90000),(F46*10000)+(H46*1000)+(J46*10)+E46-(G46*10000)-(I46*1000)+O46))))))","v":-23998},{"$f":"IF(E46=0,\"\",RANK(M46,M46:M50))","v":3},{"$f":"'1. Runde Gruppen'!O19","v":0},{"$f":"IF(D46=\"\",\"\",D46)","v":"Swennen Andy"},{"$f":"IF(V46=\"\",\"\",1)","v":1},5,5,"E",{"$f":"C46","v":"E1"},{"$f":"D46","v":"Swennen Andy"},{"$f":"C47","v":"E2"},{"$f":"D47","v":"Fandrei Andreas"},"","","",{"$f":"Matches!O46","v":0},{"$f":"Matches!P46","v":0},null,null,{"$f":"VLOOKUP(S46,$Y$2:$AC$88,4,FALSE)","v":0},{"$f":"VLOOKUP(S46,$Y$2:$AC$88,5,FALSE)","v":2},{"$f":"IF(AF46>AG46,1,0)","v":0},{"$f":"IF(AG46>AF46,1,0)","v":1},{"$f":"IF(AF46+AG46>=1,1,0)","v":1},{"$f":"IF(AND(AF46+AG46>1,AF46=AG46),1,0)","v":0},null,null,null,null,null,null,null,null,null,null,null,null,null,null,null,null,null,null,null,null,"",null,"","A3","A3","A3","A3","A3","A3","A3","A3","A3","A3","A3","A3","A3","A3","A3","A3","A3","A3","A3","A3","A3","A3","A3","A3","A3","A3","A3","A3","A3","A3","A3","A3","A3","A3","A3",null,"A3",{"$f":"IF(ROW(CS45)>COUNTA(CS45:CS102),\"\",INDEX(CS45:CS102,SMALL(IF(CS$43:CS$100<>\"\",ROW($43:$100)),ROW(CS45))))","v":""},null,null,null,"",null,null,{"$f":"Spieler!N46","v":""},null,null,null,null,null,null,null,null,{"$f":"IFERROR(LARGE($DH$2:$DH$41,37),\"\")","v":""},"",null,{"$f":"DA46","v":""},""]
[null,2,"E2",{"$f":"'1. Runde Gruppen'!D20","v":"Fandrei Andreas"},{"$f":"AJ46+AJ51+AJ47+AJ55","v":2},{"$f":"AI46+AH47+AH51+AH55","v":1},{"$f":"AH46+AI51+AI47+AI55","v":1},{"$f":"AG46+AF55+AF51+AF47","v":2},{"$f":"AF46+AG47+AG51+AG55","v":2},{"$f":"AK46+AK51+AK47+AK55","v":0},null,null,{"$f":"IF(D47=\"X\",-200000,IF(D47=\"Y\",-200000,IF(D47=\"Z\",-200000,IF(D47=\"\",-200000,IF(D47=\"Z Freilos\",-200000,IF(D47=\"\",(-90000),(F47*10000)+(H47*1000)+(J47*10)+E47-(G47*10000)-(I47*1000)+O47))))))","v":2},{"$f":"IF(E47=0,\"\",RANK(M47,M46:M50))","v":2},{"$f":"'1. Runde Gruppen'!O20","v":0},{"$f":"IF(D47=\"\",\"\",D47)","v":"Fandrei Andreas"},{"$f":"IF(V47=\"\",\"\",2)","v":""},{"$f":"IF(B49=4,45,13)","v":13},"","E",{"$f":"C48","v":"E3"},{"$f":"IF(X47=\"\",\"\",D47)","v":""},{"$f":"C49","v":"E4"},{"$f":"D49","v":""},"","","",{"$f":"Matches!O47","v":0},{"$f":"Matches!P47","v":0},null,null,{"$f":"VLOOKUP(S47,$Y$2:$AC$88,4,FALSE)","v":0},{"$f":"VLOOKUP(S47,$Y$2:$AC$88,5,FALSE)","v":0},0,0,{"$f":"IF(AF47+AG47>=1,1,0)","v":0},{"$f":"IF(AND(AF47+AG47>1,AF47=AG47),1,0)","v":0},null,null,null,null,null,null,null,null,null,null,null,null,null,null,null,null,null,null,null,null,"",null,"","A4","A4","A4","A4","A4",null,"A4","A4","A4","A4","A4",{"$f":"IF($BV$42=\"X\",\"A4\",\"\")","v":"A4"},"A4","A4","A4","A4","A4",{"$f":"IF($BV$42=\"X\",\"\",\"A4\")","v":""},"A4","A4","A4","A4","A4","A4","A4","A4","A4","A4","A4","A4","A4","A4","A4","A4",{"$f":"IFERROR(LOOKUP($CQ$1,$BI$1:$CP$1,BI47:CP47),\"\")","v":""},null,{"$f":"IF(CQ47=0,\"\",CQ47)","v":""},{"$f":"IF(ROW(CS46)>COUNTA(CS46:CS103),\"\",INDEX(CS46:CS103,SMALL(IF(CS$43:CS$100<>\"\",ROW($43:$100)),ROW(CS46))))","v":""},null,null,null,"",null,null,{"$f":"Spieler!N47","v":""},null,null,null,null,null,null,null,null,{"$f":"IFERROR(LARGE($DH$2:$DH$41,38),\"\")","v":""},"",null,{"$f":"DA47","v":""},""]
[null,3,"E3",{"$f":"'1. Runde Gruppen'!D21","v":"Delling Tino"},{"$f":"AJ49+AJ51+AJ54+AJ53","v":2},{"$f":"AI49+AI51+AH54+AH53","v":2},{"$f":"AH49+AH51+AI54+AI53","v":0},{"$f":"AG49+AG51+AF54+AF53","v":4},{"$f":"AF49+AF51+AG54+AG53","v":0},{"$f":"AK49+AK51+AK54+AK53","v":0},null,null,24002,{"$f":"IF(E48=0,\"\",RANK(M48,M46:M50))","v":1},{"$f":"'1. Runde Gruppen'!O21","v":0},{"$f":"IF(D48=\"\",\"\",D48)","v":"Delling Tino"},{"$f":"IF(V48=\"\",\"\",3)","v":""},21,"","E",{"$f":"C46","v":"E1"},{"$f":"IF(X48=\"\",\"\",D46)","v":""},{"$f":"C50","v":"E5"},{"$f":"D50","v":""},"","","",{"$f":"Matches!O48","v":0},{"$f":"Matches!P48","v":0},null,null,0,0,0,0,{"$f":"IF(AF48+AG48>=1,1,0)","v":0},0,null,null,null,null,null,null,null,null,null,null,null,null,null,null,null,null,null,null,null,null,"",null,"","A5",null,"A5","A5",null,null,null,null,null,null,{"$f":"IF($BV$42=\"X\",\"A5\",\"\")","v":"A5"},{"$f":"IF($BV$42=\"X\",\"A5\",\"\")","v":"A5"},{"$f":"IF($BV$42=\"X\",\"A5\",\"\")","v":"A5"},{"$f":"IF($BV$42=\"X\",\"A5\",\"\")","v":"A5"},null,null,null,null,null,null,null,"B1","B1","B1","B1","B1","A5","A5","A5","A5","A5","A5","A5","A5",0,null,"",{"$f":"IF(ROW(CS47)>COUNTA(CS47:CS104),\"\",INDEX(CS47:CS104,SMALL(IF(CS$43:CS$100<>\"\",ROW($43:$100)),ROW(CS47))))","v":""},null,null,null,"",null,null,{"$f":"Spieler!N48","v":""},null,null,null,null,null,null,null,null,{"$f":"IFERROR(LARGE($DH$2:$DH$41,39),\"\")","v":""},"",null,"",""]
[null,{"$f":"IF(D49=\"\",\"\",4)","v":""},"E4",{"$f":"'1. Runde Gruppen'!D22","v":""},{"$f":"AJ47+AJ50+AJ52+AJ54","v":0},{"$f":"AI47+AH50+AI52+AI54","v":0},{"$f":"AH47+AH52+AH54+AI50","v":0},{"$f":"AG47+AF50+AG52+AG54","v":0},{"$f":"AF47+AG50+AF52+AF54","v":0},{"$f":"AK47+AK52+AK54+AK50","v":0},null,null,-200000,{"$f":"IF(E49=0,\"\",RANK(M49,M46:M50))","v":""},{"$f":"'1. Runde Gruppen'!O22","v":0},{"$f":"IF(D49=\"\",\"\",D49)","v":""},{"$f":"IF(V49=\"\",\"\",4)","v":4},29,29,"E",{"$f":"C47","v":"E2"},{"$f":"D46","v":"Swennen Andy"},{"$f":"C48","v":"E3"},{"$f":"D48","v":"Delling Tino"},"","","",{"$f":"Matches!O49","v":0},{"$f":"Matches!P49","v":0},null,null,0,2,0,1,1,0,null,null,null,null,null,null,null,null,null,null,null,null,null,null,null,null,null,null,null,null,"",null,"","B1","B1","B1","B1","B1","B1","B1","B1","B1","B1","B1","B1","B1","B1","B1","B1","B1","B1","B1","B1","B1","B2","B2","B2","B2","B2","B1","B1","B1","B1","B1","B1","B1","B1","B1",null,"B1",{"$f":"IF(ROW(CS48)>COUNTA(CS48:CS105),\"\",INDEX(CS48:CS105,SMALL(IF(CS$43:CS$100<>\"\",ROW($43:$100)),ROW(CS48))))","v":""},null,null,null,"",null,null,{"$f":"Spieler!N49","v":""},null,null,null,null,null,null,null,null,{"$f":"IFERROR(LARGE($DH$2:$DH$41,40),\"\")","v":""},"",null,"",""]
[null,{"$f":"IF(D50=\"\",\"\",5)","v":""},"E5",{"$f":"'1. Runde Gruppen'!D23","v":""},{"$f":"AJ48+AJ50+AJ53+AJ55","v":0},{"$f":"AI48+AI50+AI53+AI55","v":0},{"$f":"AH48+AH50+AH53+AH55","v":0},{"$f":"AG48+AG50+AG53+AG55","v":0},{"$f":"AF48+AF50+AF53+AF55","v":0},{"$f":"AK48+AK50+AK53+AK55","v":0},null,null,-200000,{"$f":"IF(E50=0,\"\",RANK(M50,M46:M50))","v":""},{"$f":"'1. Runde Gruppen'!O23","v":0},{"$f":"IF(D50=\"\",\"\",D50)","v":""},{"$f":"IF(V50=\"\",\"\",5)","v":""},37,"","E",{"$f":"C49","v":"E4"},{"$f":"IF(X50=\"\",\"\",D49)","v":""},{"$f":"C50","v":"E5"},{"$f":"D50","v":""},"","","",{"$f":"Matches!O50","v":0},{"$f":"Matches!P50","v":0},null,null,0,0,0,0,0,0,null,null,null,null,null,null,null,null,null,null,null,null,null,null,null,null,null,null,null,null,"",null,"","B2","B2","B2","B2","B2","B2","B2","B2","B2","B2","B2","B2","B2","B2","B2","B2","B2","B2","B2","B2","B2","B3","B3","B3","B3","B3","B2","B2","B2","B2","B2","B2","B2","B2","B2",null,"B2",{"$f":"IF(ROW(CS49)>COUNTA(CS49:CS106),\"\",INDEX(CS49:CS106,SMALL(IF(CS$43:CS$100<>\"\",ROW($43:$100)),ROW(CS49))))","v":""}]
[null,null,null,null,null,null,null,null,null,null,null,null,null,null,null,null,{"$f":"IF(V51=\"\",\"\",6)","v":6},{"$f":"IF(B49=4,69,45)","v":45},45,"E",{"$f":"C46","v":"E1"},{"$f":"D47","v":"Fandrei Andreas"},{"$f":"C48","v":"E3"},"Delling Tino","","","",{"$f":"Matches!O51","v":0},{"$f":"Matches!P51","v":0},null,null,0,2,0,1,1,0,null,null,null,null,null,null,null,null,null,null,null,null,null,null,null,null,null,null,null,null,"",null,"","B3","B3","B3","B3","B3","B3","B3","B3","B3","B3","B3","B3","B3","B3","B3","B3","B3","B3","B3","B3","B3","B4","B4","B4","B4","B4","B3","B3","B3","B3","B3","B3","B3","B3","B3",null,"B3",{"$f":"IF(ROW(CS50)>COUNTA(CS50:CS107),\"\",INDEX(CS50:CS107,SMALL(IF(CS$43:CS$100<>\"\",ROW($43:$100)),ROW(CS50))))","v":""}]
[null,null,null,null,null,null,null,null,null,null,null,null,null,null,null,null,{"$f":"IF(V52=\"\",\"\",7)","v":""},53,"","E",{"$f":"C47","v":"E2"},{"$f":"IF(X52=\"\",\"\",D46)","v":""},"E4","","","","",{"$f":"Matches!O52","v":0},{"$f":"Matches!P52","v":0},null,null,0,0,0,0,0,0,null,null,null,null,null,null,null,null,null,null,null,null,null,null,null,null,null,null,null,null,"",null,"","B4","B4","B4","B4","B4",null,null,"B4","B4","B4","B4",{"$f":"IF($BV$42=\"X\",\"B4\",\"\")","v":"B4"},{"$f":"IF($BV$42=\"X\",\"B4\",\"\")","v":"B4"},"B4","B4","B4","B4",{"$f":"IF($BV$42=\"x\",\"\",\"B4\")","v":""},null,"B4","B4",null,null,null,null,null,"B4","B4","B4","B4","B4","B4","B4","B4",{"$f":"IFERROR(LOOKUP($CQ$1,$BI$1:$CP$1,BI52:CP52),\"\")","v":""},null,{"$f":"IF(CQ52=0,\"\",CQ52)","v":""},{"$f":"IF(ROW(CS51)>COUNTA(CS51:CS108),\"\",INDEX(CS51:CS108,SMALL(IF(CS$43:CS$100<>\"\",ROW($43:$100)),ROW(CS51))))","v":""}]
[null,null,null,null,null,null,null,null,null,null,null,null,null,null,null,null,{"$f":"IF(V53=\"\",\"\",8)","v":""},61,"","E",{"$f":"C48","v":"E3"},{"$f":"IF(X53=\"\",\"\",D48)","v":""},"E5","","","","",{"$f":"Matches!O53","v":0},{"$f":"Matches!P53","v":0},null,null,0,0,0,0,0,0,null,null,null,null,null,null,null,null,null,null,null,null,null,null,null,null,null,null,null,null,"",null,"","B5",null,null,"B5",null,null,null,null,null,null,null,{"$f":"IF($BV$42=\"X\",\"B5\",\"\")","v":"B5"},{"$f":"IF($BV$42=\"X\",\"B5\",\"\")","v":"B5"},{"$f":"IF($BV$42=\"X\",\"B5\",\"\")","v":"B5"},null,null,null,null,null,null,null,null,null,null,null,null,null,"B5","B5","B5","B5","B5","B5","B5",0,null,"",{"$f":"IF(ROW(CS52)>COUNTA(CS52:CS109),\"\",INDEX(CS52:CS109,SMALL(IF(CS$43:CS$100<>\"\",ROW($43:$100)),ROW(CS52))))","v":""}]
[null,null,null,null,null,null,null,null,null,null,null,null,null,null,null,null,{"$f":"IF(V54=\"\",\"\",9)","v":""},{"$f":"IF(B49=4,13,69)","v":69},"","E",{"$f":"C46","v":"E1"},{"$f":"IF(X54=\"\",\"\",D48)","v":""},{"$f":"C49","v":"E4"},{"$f":"D49","v":""},"","","",{"$f":"Matches!O54","v":0},{"$f":"Matches!P54","v":0},null,null,0,0,0,0,0,0,null,null,null,null,null,null,null,null,null,null,null,null,null,null,null,null,null,null,null,null,"",null,"","C1",null,null,null,"C1","C1","C1","C1","C1","C1","C1","C1","C1","C1","C1","C1","C1","C1","C1","C1","C1","C1","C1","C1","C1","C1","C1","C1","C1","C1","C1","C1","C1","C1","C1",null,"C1",{"$f":"IF(ROW(CS53)>COUNTA(CS53:CS110),\"\",INDEX(CS53:CS110,SMALL(IF(CS$43:CS$100<>\"\",ROW($43:$100)),ROW(CS53))))","v":""}]
[null,null,null,null,null,null,null,null,null,null,null,null,null,null,null,null,{"$f":"IF(V55=\"\",\"\",10)","v":""},77,"","E",{"$f":"C47","v":"E2"},{"$f":"IF(X55=\"\",\"\",D47)","v":""},{"$f":"C50","v":"E5"},{"$f":"D50","v":""},"","","",{"$f":"Matches!O55","v":0},{"$f":"Matches!P55","v":0},null,null,{"$f":"VLOOKUP(S55,$Y$2:$AC$88,4,FALSE)","v":0},{"$f":"VLOOKUP(S55,$Y$2:$AC$88,5,FALSE)","v":0},0,0,0,0,null,null,null,null,null,null,null,null,null,null,null,null,null,null,null,null,null,null,null,null,"",null,"","C2",null,null,null,"C2","C2","C2","C2","C2","C2","C2","C2","C2","C2","C2","C2","C2","C2","C2","C2","C2","C2","C2","C2","C2","C2","C2","C2","C2","C2","C2","C2","C2","C2","C2",null,"C2",{"$f":"IF(ROW(CS54)>COUNTA(CS54:CS111),\"\",INDEX(CS54:CS111,SMALL(IF(CS$43:CS$100<>\"\",ROW($43:$100)),ROW(CS54))))","v":""}]
["F",null,null,"Spieler","M","W","L","F+","F-","U",null,null,"Rang","Rang","P+",null,null,null,"",null,null,null,null,null,"","","",{"$f":"Matches!O56","v":0},{"$f":"Matches!P56","v":0},null,null,null,null,null,null,null,null,null,null,null,null,null,null,null,null,null,null,null,null,null,null,null,null,null,null,null,null,"",null,"","C3",null,null,null,"C3","C3","C3","C3","C3","C3","C3","C3","C3","C3","C3","C3","C3","C3","C3","C3","C3","C3","C3","C3","C3","C3","C3","C3","C3","C3","C3","C3","C3","C3","C3",null,"C3",{"$f":"IF(ROW(CS55)>COUNTA(CS55:CS112),\"\",INDEX(CS55:CS112,SMALL(IF(CS$43:CS$100<>\"\",ROW($43:$100)),ROW(CS55))))","v":""}]
[null,1,"F1",{"$f":"'1. Runde Gruppen'!T19","v":"Jeroch Paul"},{"$f":"AJ57+AJ60+AJ63+AJ59","v":2},{"$f":"AH57+AH60+AH63+AH59","v":2},{"$f":"AI57+AI60+AI63+AI59","v":0},{"$f":"AF57+AF60+AF63+AF59","v":4},{"$f":"AG57+AG60+AG63+AG59","v":1},{"$f":"AK57+AK60+AK63+AK59","v":0},null,null,{"$f":"IF(D57=\"X\",-200000,IF(D57=\"Y\",-200000,IF(D57=\"Z\",-200000,IF(D57=\"\",-200000,IF(D57=\"Z Freilos\",-200000,IF(D57=\"\",(-90000),(F57*10000)+(H57*1000)+(J57*10)+E57-(G57*10000)-(I57*1000)+O57))))))","v":23002},{"$f":"IF(E57=0,\"\",RANK(M57,M57:M61))","v":1},{"$f":"'1. Runde Gruppen'!AE19","v":0},{"$f":"IF(D57=\"\",\"\",D57)","v":"Jeroch Paul"},{"$f":"IF(V57=\"\",\"\",1)","v":1},6,6,"F",{"$f":"C57","v":"F1"},{"$f":"D57","v":"Jeroch Paul"},{"$f":"C58","v":"F2"},{"$f":"D58","v":"Müller Marcus"},"","","",{"$f":"Matches!O57","v":0},{"$f":"Matches!P57","v":0},null,null,{"$f":"VLOOKUP(S57,$Y$2:$AC$88,4,FALSE)","v":2},{"$f":"VLOOKUP(S57,$Y$2:$AC$88,5,FALSE)","v":0},{"$f":"IF(AF57>AG57,1,0)","v":1},{"$f":"IF(AG57>AF57,1,0)","v":0},{"$f":"IF(AF57+AG57>=1,1,0)","v":1},{"$f":"IF(AND(AF57+AG57>1,AF57=AG57),1,0)","v":0},null,null,null,null,null,null,null,null,null,null,null,null,null,null,null,null,null,null,null,null,"",null,"","C4",null,null,null,null,null,null,null,"C4","C4",{"$f":"IF($BV$42=\"X\",\"C4\",\"\")","v":"C4"},{"$f":"IF($BV$42=\"X\",\"C4\",\"\")","v":"C4"},{"$f":"IF($BV$42=\"X\",\"C4\",\"\")","v":"C4"},{"$f":"IF($BV$42=\"X\",\"C4\",\"\")","v":"C4"},"C4","C4",{"$f":"BI57","v":"C4"},{"$f":"IF($BV$42=\"x\",\"\",\"C4\")","v":""},null,null,"C4","C4","C4","C4","C4","C4","C4","C4","C4","C4","C4","C4","C4","C4","",null,"",{"$f":"IF(ROW(CS56)>COUNTA(CS56:CS113),\"\",INDEX(CS56:CS113,SMALL(IF(CS$43:CS$100<>\"\",ROW($43:$100)),ROW(CS56))))","v":""}]
[null,2,"F2",{"$f":"'1. Runde Gruppen'!T20","v":"Müller Marcus"},{"$f":"AJ57+AJ62+AJ58+AJ66","v":2},{"$f":"AI57+AH58+AH62+AH66","v":1},{"$f":"AH57+AI62+AI58+AI66","v":1},{"$f":"AG57+AF66+AF62+AF58","v":2},{"$f":"AF57+AG58+AG62+AG66","v":2},{"$f":"AK57+AK62+AK58+AK66","v":0},null,null,{"$f":"IF(D58=\"X\",-200000,IF(D58=\"Y\",-200000,IF(D58=\"Z\",-200000,IF(D58=\"\",-200000,IF(D58=\"Z Freilos\",-200000,IF(D58=\"\",(-90000),(F58*10000)+(H58*1000)+(J58*10)+E58-(G58*10000)-(I58*1000)+O58))))))","v":2},{"$f":"IF(E58=0,\"\",RANK(M58,M57:M61))","v":2},{"$f":"'1. Runde Gruppen'!AE20","v":0},{"$f":"IF(D58=\"\",\"\",D58)","v":"Müller Marcus"},{"$f":"IF(V58=\"\",\"\",2)","v":""},{"$f":"IF(B60=4,46,14)","v":14},"","F",{"$f":"C59","v":"F3"},{"$f":"IF(X58=\"\",\"\",D58)","v":""},{"$f":"C60","v":"F4"},{"$f":"D60","v":""},"","","",{"$f":"Matches!O58","v":0},{"$f":"Matches!P58","v":0},null,null,{"$f":"VLOOKUP(S58,$Y$2:$AC$88,4,FALSE)","v":0},{"$f":"VLOOKUP(S58,$Y$2:$AC$88,5,FALSE)","v":0},0,0,{"$f":"IF(AF58+AG58>=1,1,0)","v":0},{"$f":"IF(AND(AF58+AG58>1,AF58=AG58),1,0)","v":0},null,null,null,null,null,null,null,null,null,null,null,null,null,null,null,null,null,null,null,null,"",null,"","C5",null,null,null,null,null,null,null,null,null,null,null,{"$f":"IF($BV$42=\"X\",\"C5\",\"\")","v":"C5"},{"$f":"IF($BV$42=\"X\",\"C5\",\"\")","v":"C5"},null,null,null,null,null,null,null,null,null,null,null,null,null,null,"C5","C5","C5","C5","C5","C5",0,null,"",{"$f":"IF(ROW(CS57)>COUNTA(CS57:CS114),\"\",INDEX(CS57:CS114,SMALL(IF(CS$43:CS$100<>\"\",ROW($43:$100)),ROW(CS57))))","v":""}]
[null,3,"F3",{"$f":"'1. Runde Gruppen'!T21","v":"Rejke Ronny"},{"$f":"AJ60+AJ62+AJ65+AJ64","v":2},{"$f":"AI60+AI62+AH65+AH64","v":0},{"$f":"AH60+AH62+AI65+AI64","v":2},{"$f":"AG60+AG62+AF65+AF64","v":1},{"$f":"AF60+AF62+AG65+AG64","v":4},{"$f":"AK60+AK62+AK65+AK64","v":0},null,null,-22998,{"$f":"IF(E59=0,\"\",RANK(M59,M57:M61))","v":3},{"$f":"'1. Runde Gruppen'!AE21","v":0},{"$f":"IF(D59=\"\",\"\",D59)","v":"Rejke Ronny"},{"$f":"IF(V59=\"\",\"\",3)","v":""},22,"","F",{"$f":"C57","v":"F1"},{"$f":"IF(X59=\"\",\"\",D57)","v":""},{"$f":"C61","v":"F5"},{"$f":"D61","v":""},"","","",{"$f":"Matches!O59","v":0},{"$f":"Matches!P59","v":0},null,null,0,0,0,0,{"$f":"IF(AF59+AG59>=1,1,0)","v":0},0,null,null,null,null,null,null,null,null,null,null,null,null,null,null,null,null,null,null,null,null,"",null,"","D1",null,null,null,null,"D1","D1","D1","D1","D1","D1","D1","D1","D1","D1","D1","D1","D1","D1","D1","D1","D1","D1","D1","D1","D1","D1","D1","D1","D1","D1","D1","D1","D1",{"$f":"IFERROR(LOOKUP($CQ$1,$BI$1:$CP$1,BI59:CP59),\"\")","v":"D1"},null,"D1",{"$f":"IF(ROW(CS58)>COUNTA(CS58:CS115),\"\",INDEX(CS58:CS115,SMALL(IF(CS$43:CS$100<>\"\",ROW($43:$100)),ROW(CS58))))","v":""}]
[null,{"$f":"IF(D60=\"\",\"\",4)","v":""},"F4",{"$f":"'1. Runde Gruppen'!T22","v":""},{"$f":"AJ58+AJ61+AJ63+AJ65","v":0},{"$f":"AI58+AH61+AI63+AI65","v":0},{"$f":"AH58+AH63+AH65+AI61","v":0},{"$f":"AG58+AF61+AG63+AG65","v":0},{"$f":"AF58+AG61+AF63+AF65","v":0},{"$f":"AK58+AK63+AK65+AK61","v":0},null,null,-200000,{"$f":"IF(E60=0,\"\",RANK(M60,M57:M61))","v":""},{"$f":"'1. Runde Gruppen'!AE22","v":0},{"$f":"IF(D60=\"\",\"\",D60)","v":""},{"$f":"IF(V60=\"\",\"\",4)","v":4},30,30,"F",{"$f":"C58","v":"F2"},{"$f":"D57","v":"Jeroch Paul"},{"$f":"C59","v":"F3"},{"$f":"D59","v":"Rejke Ronny"},"","","",{"$f":"Matches!O60","v":0},{"$f":"Matches!P60","v":0},null,null,2,1,1,0,1,0,null,null,null,null,null,null,null,null,null,null,null,null,null,null,null,null,null,null,null,null,"",null,"","D2",null,null,null,null,"D2","D2","D2","D2","D2","D2","D2","D2","D2","D2","D2","D2","D2","D2","D2","D2","D2","D2","D2","D2","D2","D2","D2","D2","D2","D2","D2","D2","D2","D2",null,"D2"]
[null,{"$f":"IF(D61=\"\",\"\",5)","v":""},"F5",{"$f":"'1. Runde Gruppen'!T23","v":""},{"$f":"AJ59+AJ61+AJ64+AJ66","v":0},{"$f":"AI59+AI61+AI64+AI66","v":0},{"$f":"AH59+AH61+AH64+AH66","v":0},{"$f":"AG59+AG61+AG64+AG66","v":0},{"$f":"AF59+AF61+AF64+AF66","v":0},{"$f":"AK59+AK61+AK64+AK66","v":0},null,null,-200000,{"$f":"IF(E61=0,\"\",RANK(M61,M57:M61))","v":""},{"$f":"'1. Runde Gruppen'!AE23","v":0},{"$f":"IF(D61=\"\",\"\",D61)","v":""},{"$f":"IF(V61=\"\",\"\",5)","v":""},38,"","F",{"$f":"C60","v":"F4"},{"$f":"IF(X61=\"\",\"\",D60)","v":""},{"$f":"C61","v":"F5"},{"$f":"D61","v":""},"","","",{"$f":"Matches!O61","v":0},{"$f":"Matches!P61","v":0},null,null,0,0,0,0,0,0,null,null,null,null,null,null,null,null,null,null,null,null,null,null,null,null,null,null,null,null,"",null,"","D3",null,null,null,null,"D3","D3","D3","D3","D3","D3","D3","D3","D3","D3","D3","D3","D3","D3","D3","D3","D3","D3","D3","D3","D3","D3","D3","D3","D3","D3","D3","D3","D3","D3",null,"D3"]
[null,null,null,null,null,null,null,null,null,null,null,null,null,null,null,null,{"$f":"IF(V62=\"\",\"\",6)","v":6},{"$f":"IF(B60=4,70,46)","v":46},46,"F",{"$f":"C57","v":"F1"},{"$f":"D58","v":"Müller Marcus"},{"$f":"C59","v":"F3"},"Rejke Ronny","","","",{"$f":"Matches!O62","v":0},{"$f":"Matches!P62","v":0},null,null,2,0,1,0,1,0,null,null,null,null,null,null,null,null,null,null,null,null,null,null,null,null,null,null,null,null,"",null,"","D4",null,null,null,null,null,null,null,null,"D4",{"$f":"IF($BV$42=\"X\",\"D4\",\"\")","v":"D4"},{"$f":"IF($BV$42=\"X\",\"D4\",\"\")","v":"D4"},{"$f":"IF($BV$42=\"X\",\"D4\",\"\")","v":"D4"},{"$f":"IF($BV$42=\"X\",\"D4\",\"\")","v":"D4"},null,"D4",{"$f":"BI62","v":"D4"},{"$f":"IF($BV$42=\"x\",\"\",\"D4\")","v":""},null,null,null,"D4","D4","D4","D4","D4","D4","D4","D4","D4","D4","D4","D4","D4","",null,""]
[null,null,null,null,null,null,null,null,null,null,null,null,null,null,null,null,{"$f":"IF(V63=\"\",\"\",7)","v":""},54,"","F",{"$f":"C58","v":"F2"},{"$f":"IF(X63=\"\",\"\",D57)","v":""},"F4","","","","",{"$f":"Matches!O63","v":0},{"$f":"Matches!P63","v":0},null,null,0,0,0,0,0,0,null,null,null,null,null,null,null,null,null,null,null,null,null,null,null,null,null,null,null,null,"",null,"","D5",null,null,null,null,null,null,null,null,null,null,null,null,{"$f":"IF($BV$42=\"X\",\"D5\",\"\")","v":"D5"},null,null,null,null,null,null,null,null,null,null,null,null,null,null,null,"D5","D5","D5","D5","D5",0,null,""]
[null,null,null,null,null,null,null,null,null,null,null,null,null,null,null,null,{"$f":"IF(V64=\"\",\"\",8)","v":""},62,"","F",{"$f":"C59","v":"F3"},{"$f":"IF(X64=\"\",\"\",D59)","v":""},"F5","","","","",{"$f":"Matches!O64","v":0},{"$f":"Matches!P64","v":0},null,null,0,0,0,0,0,0,null,null,null,null,null,null,null,null,null,null,null,null,null,null,null,null,null,null,null,null,"",null,"","E1",null,null,null,null,null,null,null,null,null,"E1","E1","E1","E1","E1","E1","E1","E1","E1","E1","E1","E1","E1","E1","E1","E1","E1","E1","E1","E1","E1","E1","E1","E1",{"$f":"IFERROR(IF(AND($BV$42=\"X\",$CQ$43<21),\"\",LOOKUP($CQ$1,$BI$1:$CP$1,BI64:CP64)),\"\")","v":"E1"},null,{"$f":"IF(AND($CQ$43>20,$BV$42=\"X\"),CQ64,IF(CQ64=0,\"\",CQ64))","v":"E1"}]
[null,null,null,null,null,null,null,null,null,null,null,null,null,null,null,null,{"$f":"IF(V65=\"\",\"\",9)","v":""},{"$f":"IF(B60=4,14,70)","v":70},"","F",{"$f":"C57","v":"F1"},{"$f":"IF(X65=\"\",\"\",D59)","v":""},{"$f":"C60","v":"F4"},{"$f":"D60","v":""},"","","",{"$f":"Matches!O65","v":0},{"$f":"Matches!P65","v":0},null,null,0,0,0,0,0,0,null,null,null,null,null,null,null,null,null,null,null,null,null,null,null,null,null,null,null,null,"",null,"","E2",null,null,null,null,null,null,null,null,null,"E2","E2","E2","E2","E2","E2","E2","E2","E2","E2","E2","E2","E2","E2","E2","E2","E2","E2","E2","E2","E2","E2","E2","E2",{"$f":"IFERROR(IF(AND($BV$42=\"X\",$CQ$43<21),\"\",LOOKUP($CQ$1,$BI$1:$CP$1,BI65:CP65)),\"\")","v":"E2"},null,{"$f":"IF(AND($CQ$43>20,$BV$42=\"X\"),CQ65,IF(CQ65=0,\"\",CQ65))","v":"E2"}]
[null,null,null,null,null,null,null,null,null,null,null,null,null,null,null,null,{"$f":"IF(V66=\"\",\"\",10)","v":""},78,"","F",{"$f":"C58","v":"F2"},{"$f":"IF(X66=\"\",\"\",D58)","v":""},{"$f":"C61","v":"F5"},{"$f":"D61","v":""},"","","",{"$f":"Matches!O66","v":0},{"$f":"Matches!P66","v":0},null,null,{"$f":"VLOOKUP(S66,$Y$2:$AC$88,4,FALSE)","v":0},{"$f":"VLOOKUP(S66,$Y$2:$AC$88,5,FALSE)","v":0},0,0,0,0,null,null,null,null,null,null,null,null,null,null,null,null,null,null,null,null,null,null,null,null,"",null,"","E3",null,null,null,null,null,null,null,null,null,"E3","E3","E3","E3","E3","E3","E3","E3","E3","E3","E3","E3","E3","E3","E3","E3","E3","E3","E3","E3","E3","E3","E3","E3",{"$f":"IFERROR(IF(AND($BV$42=\"X\",$CQ$43<21),\"\",LOOKUP($CQ$1,$BI$1:$CP$1,BI66:CP66)),\"\")","v":"E3"},null,{"$f":"IF(AND($CQ$43>20,$BV$42=\"X\"),CQ66,IF(CQ66=0,\"\",CQ66))","v":"E3"}]
["G",null,null,"Spieler","M","W","L","F+","F-","U",null,null,"Rang","Rang","P+",null,null,null,{"$f":"IF(Q67=\"\",\"\",R67)","v":""},null,null,null,null,null,{"$f":"IFERROR(SMALL($S$2:$S$88,ROW()-1),\"\")","v":""},{"$f":"IFERROR(IF(Y67=\"\",\"\",VLOOKUP(Y67,$S$1:$V$88,4,FALSE)),\"\")","v":""},{"$f":"IFERROR(IF(Y67=\"\",\"\",VLOOKUP(Y67,$S$1:$X$88,6,FALSE)),\"\")","v":""},{"$f":"Matches!O67","v":0},{"$f":"Matches!P67","v":0},null,null,null,null,null,null,null,null,null,null,null,null,null,null,null,null,null,null,null,null,null,null,null,null,null,null,null,null,{"$f":"IF(Y67=\"\",\"\",VLOOKUP(Y67,$S$2:$T$88,2,FALSE))","v":""},null,{"$f":"IF(Y67=\"\",\"\",IF(Y67>0,ROW()-1))","v":""},"E4",null,null,null,null,null,null,null,null,null,null,null,null,null,null,null,{"$f":"BI67","v":"E4"},{"$f":"IF($BV$42=\"x\",\"\",\"E4\")","v":""},null,null,null,null,"E4","E4","E4","E4","E4","E4","E4","E4","E4","E4","E4","E4","",null,""]
[null,1,"G1",{"$f":"'1. Runde Gruppen'!D27","v":"Löffel Ulrich"},{"$f":"AJ68+AJ71+AJ74+AJ70","v":2},{"$f":"AH68+AH71+AH74+AH70","v":0},{"$f":"AI68+AI71+AI74+AI70","v":2},{"$f":"AF68+AF71+AF74+AF70","v":0},{"$f":"AG68+AG71+AG74+AG70","v":4},{"$f":"AK68+AK71+AK74+AK70","v":0},null,null,{"$f":"IF(D68=\"X\",-200000,IF(D68=\"Y\",-200000,IF(D68=\"Z\",-200000,IF(D68=\"\",-200000,IF(D68=\"Z Freilos\",-200000,IF(D68=\"\",(-90000),(F68*10000)+(H68*1000)+(J68*10)+E68-(G68*10000)-(I68*1000)+O68))))))","v":-23998},{"$f":"IF(E68=0,\"\",RANK(M68,M68:M72))","v":3},{"$f":"'1. Runde Gruppen'!O27","v":0},{"$f":"IF(D68=\"\",\"\",D68)","v":"Löffel Ulrich"},{"$f":"IF(V68=\"\",\"\",1)","v":1},7,7,"G",{"$f":"C68","v":"G1"},{"$f":"D68","v":"Löffel Ulrich"},{"$f":"C69","v":"G2"},{"$f":"D69","v":"Stachly Marec"},"","","",{"$f":"Matches!O68","v":0},{"$f":"Matches!P68","v":0},null,null,{"$f":"VLOOKUP(S68,$Y$2:$AC$88,4,FALSE)","v":0},{"$f":"VLOOKUP(S68,$Y$2:$AC$88,5,FALSE)","v":2},{"$f":"IF(AF68>AG68,1,0)","v":0},{"$f":"IF(AG68>AF68,1,0)","v":1},{"$f":"IF(AF68+AG68>=1,1,0)","v":1},{"$f":"IF(AND(AF68+AG68>1,AF68=AG68),1,0)","v":0},null,null,null,null,null,null,null,null,null,null,null,null,null,null,null,null,null,null,null,null,"",null,"","E5",null,null,null,null,null,null,null,null,null,null,null,null,null,null,null,null,null,null,null,null,null,null,null,null,null,null,null,null,null,"E5","E5","E5","E5",0,null,""]
[null,2,"G2",{"$f":"'1. Runde Gruppen'!D28","v":"Stachly Marec"},{"$f":"AJ68+AJ73+AJ69+AJ77","v":2},{"$f":"AI68+AH69+AH73+AH77","v":2},{"$f":"AH68+AI73+AI69+AI77","v":0},{"$f":"AG68+AF77+AF73+AF69","v":4},{"$f":"AF68+AG69+AG73+AG77","v":0},{"$f":"AK68+AK73+AK69+AK77","v":0},null,null,{"$f":"IF(D69=\"X\",-200000,IF(D69=\"Y\",-200000,IF(D69=\"Z\",-200000,IF(D69=\"\",-200000,IF(D69=\"Z Freilos\",-200000,IF(D69=\"\",(-90000),(F69*10000)+(H69*1000)+(J69*10)+E69-(G69*10000)-(I69*1000)+O69))))))","v":24002},{"$f":"IF(E69=0,\"\",RANK(M69,M68:M72))","v":1},{"$f":"'1. Runde Gruppen'!O28","v":0},{"$f":"IF(D69=\"\",\"\",D69)","v":"Stachly Marec"},{"$f":"IF(V69=\"\",\"\",2)","v":""},{"$f":"IF(B71=4,47,15)","v":15},"","G",{"$f":"C70","v":"G3"},{"$f":"IF(X69=\"\",\"\",D69)","v":""},{"$f":"C71","v":"G4"},{"$f":"D71","v":""},"","","",{"$f":"Matches!O69","v":0},{"$f":"Matches!P69","v":0},null,null,{"$f":"VLOOKUP(S69,$Y$2:$AC$88,4,FALSE)","v":0},{"$f":"VLOOKUP(S69,$Y$2:$AC$88,5,FALSE)","v":0},0,0,{"$f":"IF(AF69+AG69>=1,1,0)","v":0},{"$f":"IF(AND(AF69+AG69>1,AF69=AG69),1,0)","v":0},null,null,null,null,null,null,null,null,null,null,null,null,null,null,null,null,null,null,null,null,"",null,"","F1",null,null,null,null,null,null,null,null,null,null,"F1","F1","F1","F1","F1","F1","F1","F1","F1","F1","F1","F1","F1","F1","F1","F1","F1","F1","F1","F1","F1","F1","F1",{"$f":"IFERROR(IF(AND($BV$42=\"X\",$CQ$43<21),\"\",LOOKUP($CQ$1,$BI$1:$CP$1,BI69:CP69)),\"\")","v":"F1"},null,{"$f":"IF(AND($CQ$43>20,$BV$42=\"X\"),CQ69,IF(CQ69=0,\"\",CQ69))","v":"F1"}]
[null,3,"G3",{"$f":"'1. Runde Gruppen'!D29","v":"Hofmann Frank"},{"$f":"AJ71+AJ73+AJ76+AJ75","v":2},{"$f":"AI71+AI73+AH76+AH75","v":1},{"$f":"AH71+AH73+AI76+AI75","v":1},{"$f":"AG71+AG73+AF76+AF75","v":2},{"$f":"AF71+AF73+AG76+AG75","v":2},{"$f":"AK71+AK73+AK76+AK75","v":0},null,null,2,{"$f":"IF(E70=0,\"\",RANK(M70,M68:M72))","v":2},{"$f":"'1. Runde Gruppen'!O29","v":0},{"$f":"IF(D70=\"\",\"\",D70)","v":"Hofmann Frank"},{"$f":"IF(V70=\"\",\"\",3)","v":""},23,"","G",{"$f":"C68","v":"G1"},{"$f":"IF(X70=\"\",\"\",D68)","v":""},{"$f":"C72","v":"G5"},{"$f":"D72","v":""},"","","",{"$f":"Matches!O70","v":0},{"$f":"Matches!P70","v":0},null,null,0,0,0,0,{"$f":"IF(AF70+AG70>=1,1,0)","v":0},0,null,null,null,null,null,null,null,null,null,null,null,null,null,null,null,null,null,null,null,null,"",null,"","F2",null,null,null,null,null,null,null,null,null,null,"F2","F2","F2","F2","F2","F2","F2","F2","F2","F2","F2","F2","F2","F2","F2","F2","F2","F2","F2","F2","F2","F2","F2",{"$f":"IFERROR(IF(AND($BV$42=\"X\",$CQ$43<21),\"\",LOOKUP($CQ$1,$BI$1:$CP$1,BI70:CP70)),\"\")","v":"F2"},null,{"$f":"IF(AND($CQ$43>20,$BV$42=\"X\"),CQ70,IF(CQ70=0,\"\",CQ70))","v":"F2"}]
[null,{"$f":"IF(D71=\"\",\"\",4)","v":""},"G4",{"$f":"'1. Runde Gruppen'!D30","v":""},{"$f":"AJ69+AJ72+AJ74+AJ76","v":0},{"$f":"AI69+AH72+AI74+AI76","v":0},{"$f":"AH69+AH74+AH76+AI72","v":0},{"$f":"AG69+AF72+AG74+AG76","v":0},{"$f":"AF69+AG72+AF74+AF76","v":0},{"$f":"AK69+AK74+AK76+AK72","v":0},null,null,-200000,{"$f":"IF(E71=0,\"\",RANK(M71,M68:M72))","v":""},{"$f":"'1. Runde Gruppen'!O30","v":0},{"$f":"IF(D71=\"\",\"\",D71)","v":""},{"$f":"IF(V71=\"\",\"\",4)","v":4},31,31,"G",{"$f":"C69","v":"G2"},{"$f":"D68","v":"Löffel Ulrich"},{"$f":"C70","v":"G3"},{"$f":"D70","v":"Hofmann Frank"},"","","",{"$f":"Matches!O71","v":0},{"$f":"Matches!P71","v":0},null,null,0,2,0,1,1,0,null,null,null,null,null,null,null,null,null,null,null,null,null,null,null,null,null,null,null,null,"",null,"","F3",null,null,null,null,null,null,null,null,null,null,"F3","F3","F3","F3","F3","F3","F3","F3","F3","F3","F3","F3","F3","F3","F3","F3","F3","F3","F3","F3","F3","F3","F3",{"$f":"IFERROR(IF(AND($BV$42=\"X\",$CQ$43<21),\"\",LOOKUP($CQ$1,$BI$1:$CP$1,BI71:CP71)),\"\")","v":"F3"},null,{"$f":"IF(AND($CQ$43>20,$BV$42=\"X\"),CQ71,IF(CQ71=0,\"\",CQ71))","v":"F3"}]
[null,{"$f":"IF(D72=\"\",\"\",5)","v":""},"G5",{"$f":"'1. Runde Gruppen'!D31","v":""},{"$f":"AJ70+AJ72+AJ75+AJ77","v":0},{"$f":"AI70+AI72+AI75+AI77","v":0},{"$f":"AH70+AH72+AH75+AH77","v":0},{"$f":"AG70+AG72+AG75+AG77","v":0},{"$f":"AF70+AF72+AF75+AF77","v":0},{"$f":"AK70+AK72+AK75+AK77","v":0},null,null,-200000,{"$f":"IF(E72=0,\"\",RANK(M72,M68:M72))","v":""},{"$f":"'1. Runde Gruppen'!O31","v":0},{"$f":"IF(D72=\"\",\"\",D72)","v":""},{"$f":"IF(V72=\"\",\"\",5)","v":""},39,"","G",{"$f":"C71","v":"G4"},{"$f":"IF(X72=\"\",\"\",D71)","v":""},{"$f":"C72","v":"G5"},{"$f":"D72","v":""},"","","",{"$f":"Matches!O72","v":0},{"$f":"Matches!P72","v":0},null,null,0,0,0,0,0,0,null,null,null,null,null,null,null,null,null,null,null,null,null,null,null,null,null,null,null,null,"",null,"","F4",null,null,null,null,null,null,null,null,null,null,null,null,null,null,null,null,{"$f":"IF($BV$42=\"X\",\"\",\"F4\")","v":""},null,null,null,null,null,"F4","F4","F4","F4","F4","F4","F4","F4","F4","F4","F4",{"$f":"IFERROR(LOOKUP($CQ$1,$BI$1:$CP$1,BI72:CP72),\"\")","v":""},null,{"$f":"IF(AND(CQ43=24,$BV$42=\"\"),\"F4\",IF(CQ72=0,\"\",CQ72))","v":""}]
[null,null,null,null,null,null,null,null,null,null,null,null,null,null,null,null,{"$f":"IF(V73=\"\",\"\",6)","v":6},{"$f":"IF(B71=4,77,47)","v":47},47,"G",{"$f":"C68","v":"G1"},{"$f":"D69","v":"Stachly Marec"},{"$f":"C70","v":"G3"},"Hofmann Frank","","","",{"$f":"Matches!O73","v":0},{"$f":"Matches!P73","v":0},null,null,2,0,1,0,1,0,null,null,null,null,null,null,null,null,null,null,null,null,null,null,null,null,null,null,null,null,"",null,"","F5",null,null,null,null,null,null,null,null,null,null,null,null,null,null,null,null,null,null,null,null,null,null,null,null,null,null,null,null,null,null,"F5","F5","F5",0,null,""]
[null,null,null,null,null,null,null,null,null,null,null,null,null,null,null,null,{"$f":"IF(V74=\"\",\"\",7)","v":""},55,"","G",{"$f":"C69","v":"G2"},{"$f":"IF(X74=\"\",\"\",D68)","v":""},"G4","","","","",{"$f":"Matches!O74","v":0},{"$f":"Matches!P74","v":0},null,null,0,0,0,0,0,0,null,null,null,null,null,null,null,null,null,null,null,null,null,null,null,null,null,null,null,null,"",null,"","G1",null,null,null,null,null,null,null,null,null,null,null,null,null,null,null,null,{"$f":"IF($BV$42=\"X\",\"G1\",\"\")","v":"G1"},"G1","G1","G1","G1","G1","G1","G1","G1","G1","G1","G1","G1","G1","G1","G1","G1","G1",null,"G1"]
[null,null,null,null,null,null,null,null,null,null,null,null,null,null,null,null,{"$f":"IF(V75=\"\",\"\",8)","v":""},63,"","G",{"$f":"C70","v":"G3"},{"$f":"IF(X75=\"\",\"\",D70)","v":""},"G5","","","","",{"$f":"Matches!O75","v":0},{"$f":"Matches!P75","v":0},null,null,0,0,0,0,0,0,null,null,null,null,null,null,null,null,null,null,null,null,null,null,null,null,null,null,null,null,"",null,"","G2",null,null,null,null,null,null,null,null,null,null,null,null,null,null,null,null,{"$f":"IF($BV$42=\"X\",\"G2\",\"\")","v":"G2"},"G2","G2","G2","G2","G2","G2","G2","G2","G2","G2","G2","G2","G2","G2","G2","G2","G2",null,"G2"]
[null,null,null,null,null,null,null,null,null,null,null,null,null,null,null,null,{"$f":"IF(V76=\"\",\"\",9)","v":""},{"$f":"IF(B71=4,15,71)","v":71},"","G",{"$f":"C68","v":"G1"},{"$f":"IF(X76=\"\",\"\",D70)","v":""},{"$f":"C71","v":"G4"},{"$f":"D71","v":""},"","","",{"$f":"Matches!O76","v":0},{"$f":"Matches!P76","v":0},null,null,0,0,0,0,0,0,null,null,null,null,null,null,null,null,null,null,null,null,null,null,null,null,null,null,null,null,"",null,"","G3",null,null,null,null,null,null,null,null,null,null,null,null,null,null,null,null,{"$f":"IF($BV$42=\"X\",\"G3\",\"\")","v":"G3"},"G3","G3","G3","G3","G3","G3","G3","G3","G3","G3","G3","G3","G3","G3","G3","G3","G3",null,"G3"]
[null,null,null,null,null,null,null,null,null,null,null,null,null,null,null,null,{"$f":"IF(V77=\"\",\"\",10)","v":""},79,"","G",{"$f":"C69","v":"G2"},{"$f":"IF(X77=\"\",\"\",D69)","v":""},{"$f":"C72","v":"G5"},{"$f":"D72","v":""},"","","",{"$f":"Matches!O77","v":0},{"$f":"Matches!P77","v":0},null,null,{"$f":"VLOOKUP(S77,$Y$2:$AC$88,4,FALSE)","v":0},{"$f":"VLOOKUP(S77,$Y$2:$AC$88,5,FALSE)","v":0},0,0,0,0,null,null,null,null,null,null,null,null,null,null,null,null,null,null,null,null,null,null,null,null,"",null,"","G4",null,null,null,null,null,null,null,null,null,null,null,null,null,null,null,null,null,null,null,null,null,null,null,"G4","G4","G4","G4","G4","G4","G4","G4","G4","G4",0,null,""]
["H",null,null,"Spieler","M","W","L","F+","F-","U",null,null,"Rang","Rang","P+",null,null,null,"",null,null,null,null,null,"","","",{"$f":"Matches!O78","v":0},{"$f":"Matches!P78","v":0},null,null,null,null,null,null,null,null,null,null,null,null,null,null,null,null,null,null,null,null,null,null,null,null,null,null,null,null,"",null,"","G5",null,null,null,null,null,null,null,null,null,null,null,null,null,null,null,null,null,null,null,null,null,null,null,null,null,null,null,null,null,null,null,"G5","G5",0,null,""]
[null,1,"H1",{"$f":"'1. Runde Gruppen'!T27","v":"Elham Faiz"},{"$f":"AJ79+AJ82+AJ85+AJ81","v":2},{"$f":"AH79+AH82+AH85+AH81","v":0},{"$f":"AI79+AI82+AI85+AI81","v":2},{"$f":"AF79+AF82+AF85+AF81","v":1},{"$f":"AG79+AG82+AG85+AG81","v":4},{"$f":"AK79+AK82+AK85+AK81","v":0},null,null,{"$f":"IF(D79=\"X\",-200000,IF(D79=\"Y\",-200000,IF(D79=\"Z\",-200000,IF(D79=\"\",-200000,IF(D79=\"Z Freilos\",-200000,IF(D79=\"\",(-90000),(F79*10000)+(H79*1000)+(J79*10)+E79-(G79*10000)-(I79*1000)+O79))))))","v":-22998},{"$f":"IF(E79=0,\"\",RANK(M79,M79:M83))","v":3},{"$f":"'1. Runde Gruppen'!AE27","v":0},{"$f":"IF(D79=\"\",\"\",D79)","v":"Elham Faiz"},{"$f":"IF(V79=\"\",\"\",1)","v":1},8,8,"H",{"$f":"C79","v":"H1"},{"$f":"D79","v":"Elham Faiz"},{"$f":"C80","v":"H2"},{"$f":"D80","v":"Fandrei Joel"},"","","",{"$f":"Matches!O79","v":0},{"$f":"Matches!P79","v":0},null,null,{"$f":"VLOOKUP(S79,$Y$2:$AC$88,4,FALSE)","v":0},{"$f":"VLOOKUP(S79,$Y$2:$AC$88,5,FALSE)","v":2},{"$f":"IF(AF79>AG79,1,0)","v":0},{"$f":"IF(AG79>AF79,1,0)","v":1},{"$f":"IF(AF79+AG79>=1,1,0)","v":1},{"$f":"IF(AND(AF79+AG79>1,AF79=AG79),1,0)","v":0},null,null,null,null,null,null,null,null,null,null,null,null,null,null,null,null,null,null,null,null,"",null,"","H1",null,null,null,null,null,null,null,null,null,null,null,null,null,null,null,null,{"$f":"IF($BV$42=\"X\",\"H1\",\"\")","v":"H1"},"H1","H1","H1","H1","H1","H1","H1","H1","H1","H1","H1","H1","H1","H1","H1","H1","H1",null,"H1"]
[null,2,"H2",{"$f":"'1. Runde Gruppen'!T28","v":"Fandrei Joel"},{"$f":"AJ79+AJ84+AJ80+AJ88","v":2},{"$f":"AI79+AH80+AH84+AH88","v":2},{"$f":"AH79+AI84+AI80+AI88","v":0},{"$f":"AG79+AF88+AF84+AF80","v":4},{"$f":"AF79+AG80+AG84+AG88","v":1},{"$f":"AK79+AK84+AK80+AK88","v":0},null,null,{"$f":"IF(D80=\"X\",-200000,IF(D80=\"Y\",-200000,IF(D80=\"Z\",-200000,IF(D80=\"\",-200000,IF(D80=\"Z Freilos\",-200000,IF(D80=\"\",(-90000),(F80*10000)+(H80*1000)+(J80*10)+E80-(G80*10000)-(I80*1000)+O80))))))","v":23002},{"$f":"IF(E80=0,\"\",RANK(M80,M79:M83))","v":1},{"$f":"'1. Runde Gruppen'!AE28","v":0},{"$f":"IF(D80=\"\",\"\",D80)","v":"Fandrei Joel"},{"$f":"IF(V80=\"\",\"\",2)","v":""},{"$f":"IF(B82=4,48,16)","v":16},"","H",{"$f":"C81","v":"H3"},{"$f":"IF(X80=\"\",\"\",D80)","v":""},{"$f":"C82","v":"H4"},{"$f":"D82","v":""},"","","",{"$f":"Matches!O80","v":0},{"$f":"Matches!P80","v":0},null,null,{"$f":"VLOOKUP(S80,$Y$2:$AC$88,4,FALSE)","v":0},{"$f":"VLOOKUP(S80,$Y$2:$AC$88,5,FALSE)","v":0},0,0,{"$f":"IF(AF80+AG80>=1,1,0)","v":0},{"$f":"IF(AND(AF80+AG80>1,AF80=AG80),1,0)","v":0},null,null,null,null,null,null,null,null,null,null,null,null,null,null,null,null,null,null,null,null,"",null,"","H2",null,null,null,null,null,null,null,null,null,null,null,null,null,null,null,null,{"$f":"IF($BV$42=\"X\",\"H2\",\"\")","v":"H2"},"H2","H2","H2","H2","H2","H2","H2","H2","H2","H2","H2","H2","H2","H2","H2","H2","H2",null,"H2"]
[null,3,"H3",{"$f":"'1. Runde Gruppen'!T29","v":"Thomas Moritz"},{"$f":"AJ82+AJ84+AJ87+AJ86","v":2},{"$f":"AI82+AI84+AH87+AH86","v":1},{"$f":"AH82+AH84+AI87+AI86","v":1},{"$f":"AG82+AG84+AF87+AF86","v":3},{"$f":"AF82+AF84+AG87+AG86","v":3},{"$f":"AK82+AK84+AK87+AK86","v":0},null,null,2,{"$f":"IF(E81=0,\"\",RANK(M81,M79:M83))","v":2},{"$f":"'1. Runde Gruppen'!AE29","v":0},{"$f":"IF(D81=\"\",\"\",D81)","v":"Thomas Moritz"},{"$f":"IF(V81=\"\",\"\",3)","v":""},24,"","H",{"$f":"C79","v":"H1"},{"$f":"IF(X81=\"\",\"\",D79)","v":""},{"$f":"C83","v":"H5"},{"$f":"D83","v":""},"","","",{"$f":"Matches!O81","v":0},{"$f":"Matches!P81","v":0},null,null,0,0,0,0,{"$f":"IF(AF81+AG81>=1,1,0)","v":0},0,null,null,null,null,null,null,null,null,null,null,null,null,null,null,null,null,null,null,null,null,"",null,"","H3",null,null,null,null,null,null,null,null,null,null,null,null,null,null,null,null,{"$f":"IF($BV$42=\"X\",\"H3\",\"\")","v":"H3"},"H3","H3","H3","H3","H3","H3","H3","H3","H3","H3","H3","H3","H3","H3","H3","H3","H3",null,"H3"]
[null,{"$f":"IF(D82=\"\",\"\",4)","v":""},"H4",{"$f":"'1. Runde Gruppen'!T30","v":""},{"$f":"AJ80+AJ83+AJ85+AJ87","v":0},{"$f":"AI80+AH83+AI85+AI87","v":0},{"$f":"AH80+AH85+AH87+AI83","v":0},{"$f":"AG80+AF83+AG85+AG87","v":0},{"$f":"AF80+AG83+AF85+AF87","v":0},{"$f":"AK80+AK85+AK87+AK83","v":0},null,null,-200000,{"$f":"IF(E82=0,\"\",RANK(M82,M79:M83))","v":""},{"$f":"'1. Runde Gruppen'!AE30","v":0},{"$f":"IF(D82=\"\",\"\",D82)","v":""},{"$f":"IF(V82=\"\",\"\",4)","v":4},32,32,"H",{"$f":"C80","v":"H2"},{"$f":"D79","v":"Elham Faiz"},{"$f":"C81","v":"H3"},{"$f":"D81","v":"Thomas Moritz"},"","","",null,null,null,null,1,2,0,1,1,0,null,null,null,null,null,null,null,null,null,null,null,null,null,null,null,null,null,null,null,null,null,null,"","H4",null,null,null,null,null,null,null,null,null,null,null,null,null,null,null,null,null,null,null,null,null,null,null,null,"H4","H4","H4","H4","H4","H4","H4","H4","H4",0,null,""]
[null,{"$f":"IF(D83=\"\",\"\",5)","v":""},"H5",{"$f":"'1. Runde Gruppen'!T31","v":""},{"$f":"AJ81+AJ83+AJ86+AJ88","v":0},{"$f":"AI81+AI83+AI86+AI88","v":0},{"$f":"AH81+AH83+AH86+AH88","v":0},{"$f":"AG81+AG83+AG86+AG88","v":0},{"$f":"AF81+AF83+AF86+AF88","v":0},{"$f":"AK81+AK83+AK86+AK88","v":0},null,null,-200000,{"$f":"IF(E83=0,\"\",RANK(M83,M79:M83))","v":""},{"$f":"'1. Runde Gruppen'!AE31","v":0},{"$f":"IF(D83=\"\",\"\",D83)","v":""},{"$f":"IF(V83=\"\",\"\",5)","v":""},40,"","H",{"$f":"C82","v":"H4"},{"$f":"IF(X83=\"\",\"\",D82)","v":""},{"$f":"C83","v":"H5"},{"$f":"D83","v":""},"","","",null,null,null,null,0,0,0,0,0,0,null,null,null,null,null,null,null,null,null,null,null,null,null,null,null,null,null,null,null,null,null,null,"","H5",null,null,null,null,null,null,null,null,null,null,null,null,null,null,null,null,null,null,null,null,null,null,null,null,null,null,null,null,null,null,null,null,"H5",0,null,""]
[null,null,null,null,null,null,null,null,null,null,null,null,null,null,null,null,{"$f":"IF(V84=\"\",\"\",6)","v":6},{"$f":"IF(B82=4,78,48)","v":48},48,"H",{"$f":"C79","v":"H1"},{"$f":"D80","v":"Fandrei Joel"},{"$f":"C81","v":"H3"},"Thomas Moritz","","","",null,null,null,null,2,1,1,0,1,0,null,null,null,null,null,null,null,null,null,null,null,null,null,null,null,null,null,null,null,null,null,null,""]
[null,null,null,null,null,null,null,null,null,null,null,null,null,null,null,null,{"$f":"IF(V85=\"\",\"\",7)","v":""},56,"","H",{"$f":"C80","v":"H2"},{"$f":"IF(X85=\"\",\"\",D79)","v":""},"H4","","","","",null,null,null,null,0,0,0,0,0,0,null,null,null,null,null,null,null,null,null,null,null,null,null,null,null,null,null,null,null,null,null,null,""]
[null,null,null,null,null,null,null,null,null,null,null,null,null,null,null,null,{"$f":"IF(V86=\"\",\"\",8)","v":""},64,"","H",{"$f":"C81","v":"H3"},{"$f":"IF(X86=\"\",\"\",D81)","v":""},"H5","","","","",null,null,null,null,0,0,0,0,0,0,null,null,null,null,null,null,null,null,null,null,null,null,null,null,null,null,null,null,null,null,null,null,""]
[null,null,null,null,null,null,null,null,null,null,null,null,null,null,null,null,{"$f":"IF(V87=\"\",\"\",9)","v":""},{"$f":"IF(B82=4,16,72)","v":72},"","H",{"$f":"C79","v":"H1"},{"$f":"IF(X87=\"\",\"\",D81)","v":""},{"$f":"C82","v":"H4"},{"$f":"D82","v":""},"","","",null,null,null,null,0,0,0,0,0,0,null,null,null,null,null,null,null,null,null,null,null,null,null,null,null,null,null,null,null,null,null,null,""]
[null,null,null,null,null,null,null,null,null,null,null,null,null,null,null,null,{"$f":"IF(V88=\"\",\"\",10)","v":""},80,"","H",{"$f":"C80","v":"H2"},{"$f":"IF(X88=\"\",\"\",D80)","v":""},{"$f":"C83","v":"H5"},{"$f":"D83","v":""},"","","",null,null,null,null,{"$f":"VLOOKUP(S88,$Y$2:$AC$88,4,FALSE)","v":0},{"$f":"VLOOKUP(S88,$Y$2:$AC$88,5,FALSE)","v":0},0,0,0,0,null,null,null,null,null,null,null,null,null,null,null,null,null,null,null,null,null,null,null,null,null,null,"","2. Gruppenrunde",null,null,null,null,null,null,null,null,null,null,null,null,{"$f":"BV42","v":"X"}]
[null,null,null,null,"F+","F+","F+","F+",null,null,null,null,null,null,null,null,null,null,null,null,null,null,null,null,null,null,null,null,null,null,null,null,null,null,null,null,null,null,null,null,null,null,null,null,null,null,null,null,null,null,null,null,null,null,null,null,null,null,null,null,null,null,null,null,11,null,null,null,null,null,17,18,19,20,21,22,23,24,null,null,null,null,null,null,null,null,null,null,null,null,null,null,null,null,{"$f":"CQ43","v":24}]
[null,1,"A1",{"$f":"VLOOKUP(1,$N$2:$P$6,3,FALSE)","v":"Gärtner David"},{"$f":"IFERROR(VLOOKUP(D90,Finals!$B$4:$C$26,2,FALSE),\"\")","v":2},{"$f":"IFERROR(VLOOKUP(D90,Finals!$J$6:$K$24,2,FALSE),\"\")","v":0},{"$f":"IFERROR(VLOOKUP(D90,Finals!$Q$10:$R$20,2,FALSE),\"\")","v":""},{"$f":"IFERROR(VLOOKUP(D90,Finals!$X$23:$Y$24,2,FALSE),\"\")","v":""},{"$f":"IFERROR(VLOOKUP(D90,Finals!$X$14:$Y$15,2,FALSE),\"\")","v":""},null,null,null,null,null,null,null,null,null,null,null,null,null,null,null,null,null,null,null,null,null,null,null,null,null,"A1",null,null,null,null,null,null,null,null,null,null,null,null,null,null,null,null,null,null,null,null,null,null,null,null,{"$f":"C90","v":"A1"},{"$f":"D90","v":"Gärtner David"},null,null,null,{"$f":"BI90","v":"Gärtner David"},null,null,null,null,null,{"$f":"$BI$90","v":"Gärtner David"},"Gärtner David","Gärtner David","Gärtner David","Gärtner David","Gärtner David","Gärtner David","Gärtner David",null,null,null,null,null,null,null,null,null,null,null,null,null,null,null,"A1",{"$f":"IFERROR(IF(AND($CQ$89>16,$CQ$89<=24),LOOKUP($CQ$89,$BS$89:$BZ$89,BS90:BZ90),\"\"),\"\")","v":"Gärtner David"}]
[null,1,"B1",{"$f":"VLOOKUP(1,$N$13:$P$17,3,FALSE)","v":"Weber Marco"},{"$f":"IFERROR(VLOOKUP(D91,Finals!$B$4:$C$26,2,FALSE),\"\")","v":2},{"$f":"IFERROR(VLOOKUP(D91,Finals!$J$6:$K$24,2,FALSE),\"\")","v":2},{"$f":"IFERROR(VLOOKUP(D91,Finals!$Q$10:$R$20,2,FALSE),\"\")","v":2},{"$f":"IFERROR(VLOOKUP(D91,Finals!$X$23:$Y$24,2,FALSE),\"\")","v":""},{"$f":"IFERROR(VLOOKUP(D91,Finals!$X$14:$Y$15,2,FALSE),\"\")","v":2},null,null,null,null,null,null,null,null,null,null,null,null,null,null,null,null,null,null,null,null,null,null,null,null,null,"A2",null,null,null,null,null,null,null,null,null,null,null,null,null,null,null,null,null,null,null,null,null,null,null,null,"B1","Weber Marco",null,null,null,{"$f":"BI107","v":"Brömel Frank"},null,null,null,null,null,{"$f":"$BI$94","v":"Delling Tino"},{"$f":"$BI$94","v":"Delling Tino"},"Delling Tino","Delling Tino","Delling Tino","Delling Tino","Delling Tino","Delling Tino",null,null,null,null,null,null,null,null,null,null,null,null,null,null,null,"A2",{"$f":"IFERROR(IF(AND($CQ$89>16,$CQ$89<=24),LOOKUP($CQ$89,$BS$89:$BZ$89,BS91:BZ91),\"\"),\"\")","v":"Delling Tino"}]
[null,1,"C1",{"$f":"VLOOKUP(1,$N$24:$P$28,3,FALSE)","v":"Witzik Oliver"},{"$f":"IFERROR(VLOOKUP(D92,Finals!$B$4:$C$26,2,FALSE),\"\")","v":0},{"$f":"IFERROR(VLOOKUP(D92,Finals!$J$6:$K$24,2,FALSE),\"\")","v":""},{"$f":"IFERROR(VLOOKUP(D92,Finals!$Q$10:$R$20,2,FALSE),\"\")","v":""},{"$f":"IFERROR(VLOOKUP(D92,Finals!$X$23:$Y$24,2,FALSE),\"\")","v":""},{"$f":"IFERROR(VLOOKUP(D92,Finals!$X$14:$Y$15,2,FALSE),\"\")","v":""},null,null,null,null,null,null,null,null,null,null,null,null,null,null,null,null,null,null,null,null,null,null,null,null,null,"A3",null,null,null,null,null,null,null,null,null,null,null,null,null,null,null,null,null,null,null,null,null,null,null,null,"C1","Witzik Oliver",null,null,null,null,null,null,null,null,null,{"$f":"BI107","v":"Brömel Frank"},{"$f":"$BI$101","v":"Suttner Magnus"},"Suttner Magnus","Suttner Magnus","Suttner Magnus","Suttner Magnus","Suttner Magnus","Suttner Magnus",null,null,null,null,null,null,null,null,null,null,null,null,null,null,null,"A3","Suttner Magnus"]
[null,1,"D1",{"$f":"VLOOKUP(1,$N$35:$P$39,3,FALSE)","v":"Straßburger Marko"},{"$f":"IFERROR(VLOOKUP(D93,Finals!$B$4:$C$26,2,FALSE),\"\")","v":1},{"$f":"IFERROR(VLOOKUP(D93,Finals!$J$6:$K$24,2,FALSE),\"\")","v":""},{"$f":"IFERROR(VLOOKUP(D93,Finals!$Q$10:$R$20,2,FALSE),\"\")","v":""},{"$f":"IFERROR(VLOOKUP(D93,Finals!$X$23:$Y$24,2,FALSE),\"\")","v":""},{"$f":"IFERROR(VLOOKUP(D93,Finals!$X$14:$Y$15,2,FALSE),\"\")","v":""},null,null,null,null,null,null,null,null,null,null,null,null,null,null,null,null,null,null,null,null,null,null,null,null,null,"B1",null,null,null,null,null,null,null,null,null,null,null,null,null,null,null,null,null,null,null,null,null,null,null,null,"D1","Straßburger Marko",null,null,null,{"$f":"BI91","v":"Weber Marco"},null,null,null,null,null,{"$f":"$BI$91","v":"Weber Marco"},{"$f":"$BI$91","v":"Weber Marco"},"Weber Marco","Weber Marco","Weber Marco","Weber Marco","Weber Marco","Weber Marco",null,null,null,null,null,null,null,null,null,null,null,null,null,null,null,"B1","Weber Marco"]
[null,1,"E1",{"$f":"VLOOKUP(1,$N$46:$P$50,3,FALSE)","v":"Delling Tino"},{"$f":"IFERROR(VLOOKUP(D94,Finals!$B$4:$C$26,2,FALSE),\"\")","v":2},{"$f":"IFERROR(VLOOKUP(D94,Finals!$J$6:$K$24,2,FALSE),\"\")","v":1},{"$f":"IFERROR(VLOOKUP(D94,Finals!$Q$10:$R$20,2,FALSE),\"\")","v":""},{"$f":"IFERROR(VLOOKUP(D94,Finals!$X$23:$Y$24,2,FALSE),\"\")","v":""},{"$f":"IFERROR(VLOOKUP(D94,Finals!$X$14:$Y$15,2,FALSE),\"\")","v":""},null,null,null,null,null,null,null,null,null,null,null,null,null,null,null,null,null,null,null,null,null,null,null,null,null,"B2",null,null,null,null,null,null,null,null,null,null,null,null,null,null,null,null,null,null,null,null,null,null,null,null,"E1","Delling Tino",null,null,null,{"$f":"BI106","v":"Brachmanski Dave"},null,null,null,null,null,{"$f":"BI100","v":"Behling Oliver"},{"$f":"$BI$100","v":"Behling Oliver"},"Behling Oliver","Behling Oliver","Behling Oliver","Behling Oliver","Behling Oliver","Behling Oliver",null,null,null,null,null,null,null,null,null,null,null,null,null,null,null,"B2","Behling Oliver"]
[null,1,"F1",{"$f":"VLOOKUP(1,$N$57:$P$61,3,FALSE)","v":"Jeroch Paul"},{"$f":"IFERROR(VLOOKUP(D95,Finals!$B$4:$C$26,2,FALSE),\"\")","v":2},{"$f":"IFERROR(VLOOKUP(D95,Finals!$J$6:$K$24,2,FALSE),\"\")","v":2},{"$f":"IFERROR(VLOOKUP(D95,Finals!$Q$10:$R$20,2,FALSE),\"\")","v":2},{"$f":"IFERROR(VLOOKUP(D95,Finals!$X$23:$Y$24,2,FALSE),\"\")","v":""},{"$f":"IFERROR(VLOOKUP(D95,Finals!$X$14:$Y$15,2,FALSE),\"\")","v":0},null,null,null,null,null,null,null,null,null,null,null,null,null,null,null,null,null,null,null,null,null,null,null,null,null,"B3",null,null,null,null,null,null,null,null,null,null,null,null,null,null,null,null,null,null,null,null,null,null,null,null,"F1","Jeroch Paul",null,null,null,null,null,null,null,null,null,{"$f":"BI101","v":"Suttner Magnus"},{"$f":"$BI$102","v":"Fandrei Andreas"},"Fandrei Andreas","Fandrei Andreas","Fandrei Andreas","Fandrei Andreas","Fandrei Andreas","Fandrei Andreas",null,null,null,null,null,null,null,null,null,null,null,null,null,null,null,"B3","Fandrei Andreas"]
[null,1,"G1",{"$f":"VLOOKUP(1,$N$68:$P$72,3,FALSE)","v":"Stachly Marec"},{"$f":"IFERROR(VLOOKUP(D96,Finals!$B$4:$C$26,2,FALSE),\"\")","v":2},{"$f":"IFERROR(VLOOKUP(D96,Finals!$J$6:$K$24,2,FALSE),\"\")","v":1},{"$f":"IFERROR(VLOOKUP(D96,Finals!$Q$10:$R$20,2,FALSE),\"\")","v":""},{"$f":"IFERROR(VLOOKUP(D96,Finals!$X$23:$Y$24,2,FALSE),\"\")","v":""},{"$f":"IFERROR(VLOOKUP(D96,Finals!$X$14:$Y$15,2,FALSE),\"\")","v":""},null,null,null,null,null,null,null,null,null,null,null,null,null,null,null,null,null,null,null,null,null,null,null,null,null,"C1",null,null,null,null,null,null,null,null,null,null,null,null,null,null,null,null,null,null,null,null,null,null,null,null,"G1","Stachly Marec",null,null,null,{"$f":"BI92","v":"Witzik Oliver"},null,null,null,null,null,{"$f":"$BI$92","v":"Witzik Oliver"},{"$f":"$BI$92","v":"Witzik Oliver"},"Witzik Oliver","Witzik Oliver","Witzik Oliver","Witzik Oliver","Witzik Oliver","Witzik Oliver",null,null,null,null,null,null,null,null,null,null,null,null,null,null,null,"C1","Witzik Oliver"]
[null,1,"H1",{"$f":"VLOOKUP(1,$N$79:$P$83,3,FALSE)","v":"Fandrei Joel"},{"$f":"IFERROR(VLOOKUP(D97,Finals!$B$4:$C$26,2,FALSE),\"\")","v":2},{"$f":"IFERROR(VLOOKUP(D97,Finals!$J$6:$K$24,2,FALSE),\"\")","v":2},{"$f":"IFERROR(VLOOKUP(D97,Finals!$Q$10:$R$20,2,FALSE),\"\")","v":1},{"$f":"IFERROR(VLOOKUP(D97,Finals!$X$23:$Y$24,2,FALSE),\"\")","v":0},{"$f":"IFERROR(VLOOKUP(D97,Finals!$X$14:$Y$15,2,FALSE),\"\")","v":""},null,null,null,null,null,null,null,null,null,null,null,null,null,null,null,null,null,null,null,null,null,null,null,null,null,"C2",null,null,null,null,null,null,null,null,null,null,null,null,null,null,null,null,null,null,null,null,null,null,null,null,"H1","Fandrei Joel",null,null,null,{"$f":"BI99","v":"Drahn Robert"},null,null,null,null,null,{"$f":"BI98","v":"Valderrama Salvador"},{"$f":"$BI$98","v":"Valderrama Salvador"},"Valderrama Salvador","Valderrama Salvador","Valderrama Salvador","Valderrama Salvador","Valderrama Salvador","Valderrama Salvador",null,null,null,null,null,null,null,null,null,null,null,null,null,null,null,"C2","Valderrama Salvador"]
[null,2,"A2",{"$f":"VLOOKUP(2,$N$2:$P$6,3,FALSE)","v":"Valderrama Salvador"},{"$f":"IFERROR(VLOOKUP(D98,Finals!$B$4:$C$26,2,FALSE),\"\")","v":1},{"$f":"IFERROR(VLOOKUP(D98,Finals!$J$6:$K$24,2,FALSE),\"\")","v":""},{"$f":"IFERROR(VLOOKUP(D98,Finals!$Q$10:$R$20,2,FALSE),\"\")","v":""},{"$f":"IFERROR(VLOOKUP(D98,Finals!$X$23:$Y$24,2,FALSE),\"\")","v":""},{"$f":"IFERROR(VLOOKUP(D98,Finals!$X$14:$Y$15,2,FALSE),\"\")","v":""},null,null,null,null,null,null,null,null,null,null,null,null,null,null,null,null,null,null,null,null,null,null,null,null,null,"C3",null,null,null,null,null,null,null,null,null,null,null,null,null,null,null,null,null,null,null,null,null,null,null,null,"A2","Valderrama Salvador",null,null,null,null,null,null,null,null,null,{"$f":"BI102","v":"Fandrei Andreas"},{"$f":"$BI$103","v":"Müller Marcus"},"Müller Marcus","Müller Marcus","Müller Marcus","Müller Marcus","Müller Marcus","Müller Marcus",null,null,null,null,null,null,null,null,null,null,null,null,null,null,null,"C3","Müller Marcus"]
[null,2,"B2",{"$f":"VLOOKUP(2,$N$13:$P$17,3,FALSE)","v":"Drahn Robert"},{"$f":"IFERROR(VLOOKUP(D99,Finals!$B$4:$C$26,2,FALSE),\"\")","v":0},{"$f":"IFERROR(VLOOKUP(D99,Finals!$J$6:$K$24,2,FALSE),\"\")","v":""},{"$f":"IFERROR(VLOOKUP(D99,Finals!$Q$10:$R$20,2,FALSE),\"\")","v":""},{"$f":"IFERROR(VLOOKUP(D99,Finals!$X$23:$Y$24,2,FALSE),\"\")","v":""},{"$f":"IFERROR(VLOOKUP(D99,Finals!$X$14:$Y$15,2,FALSE),\"\")","v":""},null,null,null,null,null,null,null,null,null,null,null,null,null,null,null,null,null,null,null,null,null,null,null,null,null,"D1",null,null,null,null,null,null,null,null,null,null,null,null,null,null,null,null,null,null,null,null,null,null,null,null,"B2","Drahn Robert",null,null,null,{"$f":"BI98","v":"Valderrama Salvador"},null,null,null,null,null,{"$f":"$BI$93","v":"Straßburger Marko"},{"$f":"$BI$93","v":"Straßburger Marko"},"Straßburger Marko","Straßburger Marko","Straßburger Marko","Straßburger Marko","Straßburger Marko","Straßburger Marko",null,null,null,null,null,null,null,null,null,null,null,null,null,null,null,"D1","Straßburger Marko"]
[null,2,"C2",{"$f":"VLOOKUP(2,$N$24:$P$28,3,FALSE)","v":"Behling Oliver"},{"$f":"IFERROR(VLOOKUP(D100,Finals!$B$4:$C$26,2,FALSE),\"\")","v":0},{"$f":"IFERROR(VLOOKUP(D100,Finals!$J$6:$K$24,2,FALSE),\"\")","v":""},{"$f":"IFERROR(VLOOKUP(D100,Finals!$Q$10:$R$20,2,FALSE),\"\")","v":""},{"$f":"IFERROR(VLOOKUP(D100,Finals!$X$23:$Y$24,2,FALSE),\"\")","v":""},{"$f":"IFERROR(VLOOKUP(D100,Finals!$X$14:$Y$15,2,FALSE),\"\")","v":""},null,null,null,null,null,null,null,null,null,null,null,null,null,null,null,null,null,null,null,null,null,null,null,null,null,"D2",null,null,null,null,null,null,null,null,null,null,null,null,null,null,null,null,null,null,null,null,null,null,null,null,"C2","Behling Oliver",null,null,null,{"$f":"BI100","v":"Behling Oliver"},null,null,null,null,null,{"$f":"BI99","v":"Drahn Robert"},{"$f":"$BI$95","v":"Jeroch Paul"},"Jeroch Paul","Jeroch Paul","Jeroch Paul","Jeroch Paul","Jeroch Paul","Jeroch Paul",null,null,null,null,null,null,null,null,null,null,null,null,null,null,null,"D2","Jeroch Paul"]
[null,2,"D2",{"$f":"VLOOKUP(2,$N$35:$P$39,3,FALSE)","v":"Suttner Magnus"},{"$f":"IFERROR(VLOOKUP(D101,Finals!$B$4:$C$26,2,FALSE),\"\")","v":1},{"$f":"IFERROR(VLOOKUP(D101,Finals!$J$6:$K$24,2,FALSE),\"\")","v":""},{"$f":"IFERROR(VLOOKUP(D101,Finals!$Q$10:$R$20,2,FALSE),\"\")","v":""},{"$f":"IFERROR(VLOOKUP(D101,Finals!$X$23:$Y$24,2,FALSE),\"\")","v":""},{"$f":"IFERROR(VLOOKUP(D101,Finals!$X$14:$Y$15,2,FALSE),\"\")","v":""},null,null,null,null,null,null,null,null,null,null,null,null,null,null,null,null,null,null,null,null,null,null,null,null,null,"D3",null,null,null,null,null,null,null,null,null,null,null,null,null,null,null,null,null,null,null,null,null,null,null,null,"D2","Suttner Magnus",null,null,null,null,null,null,null,null,null,{"$f":"BI106","v":"Brachmanski Dave"},{"$f":"$BI$99","v":"Drahn Robert"},"Drahn Robert","Drahn Robert","Drahn Robert","Drahn Robert","Drahn Robert","Drahn Robert",null,null,null,null,null,null,null,null,null,null,null,null,null,null,null,"D3","Drahn Robert"]
[null,2,"E2",{"$f":"VLOOKUP(2,$N$46:$P$50,3,FALSE)","v":"Fandrei Andreas"},{"$f":"IFERROR(VLOOKUP(D102,Finals!$B$4:$C$26,2,FALSE),\"\")","v":0},{"$f":"IFERROR(VLOOKUP(D102,Finals!$J$6:$K$24,2,FALSE),\"\")","v":""},{"$f":"IFERROR(VLOOKUP(D102,Finals!$Q$10:$R$20,2,FALSE),\"\")","v":""},{"$f":"IFERROR(VLOOKUP(D102,Finals!$X$23:$Y$24,2,FALSE),\"\")","v":""},{"$f":"IFERROR(VLOOKUP(D102,Finals!$X$14:$Y$15,2,FALSE),\"\")","v":""},null,null,null,null,null,null,null,null,null,null,null,null,null,null,null,null,null,null,null,null,null,null,null,null,null,null,null,null,null,null,null,null,null,null,null,null,null,null,null,null,null,null,null,null,null,null,null,null,null,null,"E2","Fandrei Andreas"]
[null,2,"F2",{"$f":"VLOOKUP(2,$N$57:$P$61,3,FALSE)","v":"Müller Marcus"},{"$f":"IFERROR(VLOOKUP(D103,Finals!$B$4:$C$26,2,FALSE),\"\")","v":2},{"$f":"IFERROR(VLOOKUP(D103,Finals!$J$6:$K$24,2,FALSE),\"\")","v":2},{"$f":"IFERROR(VLOOKUP(D103,Finals!$Q$10:$R$20,2,FALSE),\"\")","v":0},{"$f":"IFERROR(VLOOKUP(D103,Finals!$X$23:$Y$24,2,FALSE),\"\")","v":0},{"$f":"IFERROR(VLOOKUP(D103,Finals!$X$14:$Y$15,2,FALSE),\"\")","v":""},null,null,null,null,null,null,null,null,null,null,null,null,null,null,null,null,null,null,null,null,null,null,null,null,null,null,null,null,null,null,null,null,null,null,null,null,null,null,null,null,null,null,null,null,null,null,null,null,null,null,"F2","Müller Marcus"]
[null,2,"G2",{"$f":"VLOOKUP(2,$N$68:$P$72,3,FALSE)","v":"Hofmann Frank"},{"$f":"IFERROR(VLOOKUP(D104,Finals!$B$4:$C$26,2,FALSE),\"\")","v":0},{"$f":"IFERROR(VLOOKUP(D104,Finals!$J$6:$K$24,2,FALSE),\"\")","v":""},{"$f":"IFERROR(VLOOKUP(D104,Finals!$Q$10:$R$20,2,FALSE),\"\")","v":""},{"$f":"IFERROR(VLOOKUP(D104,Finals!$X$23:$Y$24,2,FALSE),\"\")","v":""},{"$f":"IFERROR(VLOOKUP(D104,Finals!$X$14:$Y$15,2,FALSE),\"\")","v":""},null,null,null,null,null,null,null,null,null,null,null,null,null,null,null,null,null,null,null,null,null,null,null,null,null,null,null,null,null,null,null,null,null,null,null,null,null,null,null,null,null,null,null,null,null,null,null,null,null,null,"G2","Hofmann Frank"]
[null,2,"H2",{"$f":"VLOOKUP(2,$N$79:$P$83,3,FALSE)","v":"Thomas Moritz"},{"$f":"IFERROR(VLOOKUP(D105,Finals!$B$4:$C$26,2,FALSE),\"\")","v":2},{"$f":"IFERROR(VLOOKUP(D105,Finals!$J$6:$K$24,2,FALSE),\"\")","v":0},{"$f":"IFERROR(VLOOKUP(D105,Finals!$Q$10:$R$20,2,FALSE),\"\")","v":""},{"$f":"IFERROR(VLOOKUP(D105,Finals!$X$23:$Y$24,2,FALSE),\"\")","v":""},{"$f":"IFERROR(VLOOKUP(D105,Finals!$X$14:$Y$15,2,FALSE),\"\")","v":""},null,null,null,null,null,null,null,null,null,null,null,null,null,null,null,null,null,null,null,null,null,null,null,null,null,null,null,null,null,null,null,null,null,null,null,null,null,null,null,null,null,null,null,null,null,null,null,null,null,null,"H2","Thomas Moritz"]
[null,3,"A3",{"$f":"VLOOKUP(3,$N$2:$P$6,3,FALSE)","v":"Brachmanski Dave"},{"$f":"IFERROR(VLOOKUP(D106,Finals!$B$4:$C$26,2,FALSE),\"\")","v":""},{"$f":"IFERROR(VLOOKUP(D106,Finals!$J$6:$K$24,2,FALSE),\"\")","v":""},{"$f":"IFERROR(VLOOKUP(D106,Finals!$Q$10:$R$20,2,FALSE),\"\")","v":""},{"$f":"IFERROR(VLOOKUP(D106,Finals!$X$23:$Y$24,2,FALSE),\"\")","v":""},{"$f":"IFERROR(VLOOKUP(D106,Finals!$X$14:$Y$15,2,FALSE),\"\")","v":""},null,null,null,null,null,null,null,null,null,null,null,null,null,null,null,null,null,null,null,null,null,null,null,null,null,null,null,null,null,null,null,null,null,null,null,null,null,null,null,null,null,null,null,null,null,null,null,null,null,null,"A3","Brachmanski Dave"]
[null,3,"B3",{"$f":"VLOOKUP(3,$N$13:$P$17,3,FALSE)","v":"Brömel Frank"},{"$f":"IFERROR(VLOOKUP(D107,Finals!$B$4:$C$26,2,FALSE),\"\")","v":""},{"$f":"IFERROR(VLOOKUP(D107,Finals!$J$6:$K$24,2,FALSE),\"\")","v":""},{"$f":"IFERROR(VLOOKUP(D107,Finals!$Q$10:$R$20,2,FALSE),\"\")","v":""},{"$f":"IFERROR(VLOOKUP(D107,Finals!$X$23:$Y$24,2,FALSE),\"\")","v":""},{"$f":"IFERROR(VLOOKUP(D107,Finals!$X$14:$Y$15,2,FALSE),\"\")","v":""},null,null,null,null,null,null,null,null,null,null,null,null,null,null,null,null,null,null,null,null,null,null,null,null,null,null,null,null,null,null,null,null,null,null,null,null,null,null,null,null,null,null,null,null,null,null,null,null,null,null,"B3","Brömel Frank"]
[null,3,"C3",{"$f":"VLOOKUP(3,$N$24:$P$28,3,FALSE)","v":"Isermann Rene"},{"$f":"IFERROR(VLOOKUP(D108,Finals!$B$4:$C$26,2,FALSE),\"\")","v":""},{"$f":"IFERROR(VLOOKUP(D108,Finals!$J$6:$K$24,2,FALSE),\"\")","v":""},{"$f":"IFERROR(VLOOKUP(D108,Finals!$Q$10:$R$20,2,FALSE),\"\")","v":""},{"$f":"IFERROR(VLOOKUP(D108,Finals!$X$23:$Y$24,2,FALSE),\"\")","v":""},{"$f":"IFERROR(VLOOKUP(D108,Finals!$X$14:$Y$15,2,FALSE),\"\")","v":""},null,null,null,null,null,null,null,null,null,null,null,null,null,null,null,null,null,null,null,null,null,null,null,null,null,null,null,null,null,null,null,null,null,null,null,null,null,null,null,null,null,null,null,null,null,null,null,null,null,null,"C3","Isermann Rene"]
[null,3,"D3",{"$f":"VLOOKUP(3,$N$35:$P$39,3,FALSE)","v":"Hartung Andreas"},{"$f":"IFERROR(VLOOKUP(D109,Finals!$B$4:$C$26,2,FALSE),\"\")","v":""},{"$f":"IFERROR(VLOOKUP(D109,Finals!$J$6:$K$24,2,FALSE),\"\")","v":""},{"$f":"IFERROR(VLOOKUP(D109,Finals!$Q$10:$R$20,2,FALSE),\"\")","v":""},{"$f":"IFERROR(VLOOKUP(D109,Finals!$X$23:$Y$24,2,FALSE),\"\")","v":""},{"$f":"IFERROR(VLOOKUP(D109,Finals!$X$14:$Y$15,2,FALSE),\"\")","v":""},null,null,null,null,null,null,null,null,null,null,null,null,null,null,null,null,null,null,null,null,null,null,null,null,null,null,null,null,null,null,null,null,null,null,null,null,null,null,null,null,null,null,null,null,null,null,null,null,null,null,"D3","Hartung Andreas"]
[null,3,"E3",{"$f":"VLOOKUP(3,$N$46:$P$50,3,FALSE)","v":"Swennen Andy"},{"$f":"IFERROR(VLOOKUP(D110,Finals!$B$4:$C$26,2,FALSE),\"\")","v":""},{"$f":"IFERROR(VLOOKUP(D110,Finals!$J$6:$K$24,2,FALSE),\"\")","v":""},{"$f":"IFERROR(VLOOKUP(D110,Finals!$Q$10:$R$20,2,FALSE),\"\")","v":""},{"$f":"IFERROR(VLOOKUP(D110,Finals!$X$23:$Y$24,2,FALSE),\"\")","v":""},{"$f":"IFERROR(VLOOKUP(D110,Finals!$X$14:$Y$15,2,FALSE),\"\")","v":""},null,null,null,null,null,null,null,null,null,null,null,null,null,null,null,null,null,null,null,null,null,null,null,null,null,null,null,null,null,null,null,null,null,null,null,null,null,null,null,null,null,null,null,null,null,null,null,null,null,null,"E3","Swennen Andy"]
[null,3,"F3",{"$f":"VLOOKUP(3,$N$57:$P$61,3,FALSE)","v":"Rejke Ronny"},{"$f":"IFERROR(VLOOKUP(D111,Finals!$B$4:$C$26,2,FALSE),\"\")","v":""},{"$f":"IFERROR(VLOOKUP(D111,Finals!$J$6:$K$24,2,FALSE),\"\")","v":""},{"$f":"IFERROR(VLOOKUP(D111,Finals!$Q$10:$R$20,2,FALSE),\"\")","v":""},{"$f":"IFERROR(VLOOKUP(D111,Finals!$X$23:$Y$24,2,FALSE),\"\")","v":""},{"$f":"IFERROR(VLOOKUP(D111,Finals!$X$14:$Y$15,2,FALSE),\"\")","v":""},null,null,null,null,null,null,null,null,null,null,null,null,null,null,null,null,null,null,null,null,null,null,null,null,null,null,null,null,null,null,null,null,null,null,null,null,null,null,null,null,null,null,null,null,null,null,null,null,null,null,"F3","Rejke Ronny"]
[null,3,"G3",{"$f":"VLOOKUP(3,$N$68:$P$72,3,FALSE)","v":"Löffel Ulrich"},{"$f":"IFERROR(VLOOKUP(D112,Finals!$B$4:$C$26,2,FALSE),\"\")","v":""},{"$f":"IFERROR(VLOOKUP(D112,Finals!$J$6:$K$24,2,FALSE),\"\")","v":""},{"$f":"IFERROR(VLOOKUP(D112,Finals!$Q$10:$R$20,2,FALSE),\"\")","v":""},{"$f":"IFERROR(VLOOKUP(D112,Finals!$X$23:$Y$24,2,FALSE),\"\")","v":""},{"$f":"IFERROR(VLOOKUP(D112,Finals!$X$14:$Y$15,2,FALSE),\"\")","v":""},null,null,null,null,null,null,null,null,null,null,null,null,null,null,null,null,null,null,null,null,null,null,null,null,null,null,null,null,null,null,null,null,null,null,null,null,null,null,null,null,null,null,null,null,null,null,null,null,null,null,"G3","Löffel Ulrich"]
[null,3,"H3",{"$f":"VLOOKUP(3,$N$79:$P$83,3,FALSE)","v":"Elham Faiz"},{"$f":"IFERROR(VLOOKUP(D113,Finals!$B$4:$C$26,2,FALSE),\"\")","v":""},{"$f":"IFERROR(VLOOKUP(D113,Finals!$J$6:$K$24,2,FALSE),\"\")","v":""},{"$f":"IFERROR(VLOOKUP(D113,Finals!$Q$10:$R$20,2,FALSE),\"\")","v":""},{"$f":"IFERROR(VLOOKUP(D113,Finals!$X$23:$Y$24,2,FALSE),\"\")","v":""},{"$f":"IFERROR(VLOOKUP(D113,Finals!$X$14:$Y$15,2,FALSE),\"\")","v":""},null,null,null,null,null,null,null,null,null,null,null,null,null,null,null,null,null,null,null,null,null,null,null,null,null,null,null,null,null,null,null,null,null,null,null,null,null,null,null,null,null,null,null,null,null,null,null,null,null,null,"H3","Elham Faiz"]
["Punkteberechnung",null,null,null,null,null,null,null,null,null,null,null,null,null,null,null,null,null,null,null,null,null,null,null,null,null,null,null,null,null,null,null,null,null,null,null,null,null,null,null,null,null,null,null,null,null,null,null,null,null,null,null,null,null,null,null,null,null,null,null,null,null,null,null,null,null,null,null,{"$f":"BH1","v":24}]
["Nr","Name",null,"Teilnahme","F+ 1","F+ 2","AF","VF","4.",null,null,null,null,"3/4","1/2",null,"PR2",null,null,null,"Su","x5","Su",null,"AF","VF",4,3,2,null,null,null,null,null,null,null,null,null,null,null,null,null,null,null,null,null,null,null,null,null,null,null,null,null,null,null,null,1,"Höchste","Fr+","Gesamt",null,"Platz",null,null,null,null,null,{"$f":"IF(Finals!Y14+Finals!Y15>=1,\"X\",0)","v":"X"},null,null,"Oli"]
[{"$f":"Spieler!A2","v":1},{"$f":"Spieler!C2","v":"Behling Oliver"},null,{"$f":"IF(B116=\"\",\"\",$H$165)","v":50},{"$f":"IF(B116=\"\",\"\",VLOOKUP(B116,$D$1:$H$83,5,FALSE))","v":2},{"$f":"IFERROR(IF(B116=\"\",\"\",VLOOKUP(B116,'2. Runde Gruppen'!$D$3:$H$20,5,FALSE)),\"\")","v":0},{"$f":"IFERROR(VLOOKUP(B116,$D$90:$E$113,2,FALSE),\"\")","v":0},{"$f":"IFERROR(VLOOKUP(B116,$D$90:$F$113,3,FALSE),\"\")","v":""},{"$f":"IFERROR(VLOOKUP(B116,$D$90:$G$113,4,FALSE),\"\")","v":""},null,null,null,null,{"$f":"IFERROR(VLOOKUP(B116,$D$90:$H$113,5,FALSE),\"\")","v":""},{"$f":"IFERROR(VLOOKUP(B116,$D$90:$I$113,6,FALSE),\"\")","v":""},null,{"$f":"IF(OR(F116<>\"\",G116<>\"\"),Berechnung!$H$164,D116)","v":100},{"$f":"IF(Q116<>\"\",Q116,D116)","v":100},null,4.0000000000000001E-3,{"$f":"SUM(E116:O116)","v":2},{"$f":"U116*5+T116","v":10.004},{"$f":"IF(B116=\"\",\"\",V116+R116+X116)","v":160.00400000000002},{"$f":"D116","v":50},{"$f":"IF(AND(D116=30,G116<>\"\"),$E$164,IF(AND(D116=50,G116<>\"\"),$H$164,\"\"))","v":100},{"$f":"IF(AND(D116=20,H116<>\"\"),$D$163,IF(AND(D116=30,H116<>\"\"),$E$163,IF(AND(D116=50,H116<>\"\"),$H$163,\"\")))","v":""},{"$f":"IF(B116=\"\",\"\",IF(B116=Finals!$X$7,Berechnung!$H$162,\"\"))","v":""},{"$f":"IF(B116=\"\",\"\",IF(B116=Finals!$X$6,Berechnung!$H$161,\"\"))","v":""},{"$f":"IF(B116=\"\",\"\",IF(B116=Finals!$X$5,Berechnung!$H$160,\"\"))","v":""},{"$f":"IF(E116=Finals!$X$7,Berechnung!$H$162,\"\")","v":""},null,null,null,null,null,null,null,null,null,null,null,null,null,null,null,null,null,null,null,null,null,null,null,null,null,null,null,{"$f":"IF(B116=\"\",\"\",IF(B116=Finals!$X$4,Berechnung!$H$159,\"\"))","v":""},{"$f":"IFERROR(IF(B116=\"\",\"\",LARGE(Y116:BF116:BF116,1)),0)","v":100},{"$f":"IFERROR(IF(B116=\"\",\"\",IF(BG116<>0,V116+T116,IF(BG116=0,R116+T116+V116))),\"\")","v":10.007999999999999},{"$f":"IFERROR(BG116+BH116,\"\")","v":110.008},{"$f":"B116","v":"Behling Oliver"},{"$f":"IF(B116=\"\",\"\",A116)","v":1},{"$f":"IFERROR(LARGE($BI$116:$BJ$155,1),\"\")","v":410.00360000000001},{"$f":"IF(BJ116=\"\",\"\",VLOOKUP(BL116,$BI$116:$BJ$155,2,FALSE))","v":"Weber Marco"},null,{"$f":"IF(BM116=\"\",\"\",BK116)","v":1},{"$f":"BM116","v":"Weber Marco"},{"$f":"BL116","v":410.00360000000001},{"$f":"IF(BO116=\"\",\"\",BQ114*4)","v":96},{"$f":"VLOOKUP(BP116,$B$116:$U$155,20,FALSE)","v":12},{"$f":"IF(BR116=\"\",\"\",BR116+BS116)","v":108}]
[{"$f":"Spieler!A3","v":2},{"$f":"Spieler!C3","v":"Brachmanski Dave"},null,{"$f":"IF(B117=\"\",\"\",$H$165)","v":50},{"$f":"IF(B117=\"\",\"\",VLOOKUP(B117,$D$1:$H$83,5,FALSE))","v":1},{"$f":"IFERROR(IF(B117=\"\",\"\",VLOOKUP(B117,'2. Runde Gruppen'!$D$3:$H$20,5,FALSE)),\"\")","v":""},{"$f":"IFERROR(VLOOKUP(B117,$D$90:$E$113,2,FALSE),\"\")","v":""},{"$f":"IFERROR(VLOOKUP(B117,$D$90:$F$113,3,FALSE),\"\")","v":""},{"$f":"IFERROR(VLOOKUP(B117,$D$90:$G$113,4,FALSE),\"\")","v":""},null,null,null,null,{"$f":"IFERROR(VLOOKUP(B117,$D$90:$H$113,5,FALSE),\"\")","v":""},{"$f":"IFERROR(VLOOKUP(B117,$D$90:$I$113,6,FALSE),\"\")","v":""},null,{"$f":"IF(OR(F117<>\"\",G117<>\"\"),Berechnung!$H$164,D117)","v":50},{"$f":"IF(Q117<>\"\",Q117,D117)","v":50},null,3.8999999999999998E-3,{"$f":"SUM(E117:O117)","v":1},{"$f":"U117*5+T117","v":5.0038999999999998},{"$f":"IF(B117=\"\",\"\",V117+R117+X117)","v":105.0039},{"$f":"D117","v":50},{"$f":"IF(AND(D117=30,G117<>\"\"),$E$164,IF(AND(D117=50,G117<>\"\"),$H$164,\"\"))","v":""},{"$f":"IF(AND(D117=20,H117<>\"\"),$D$163,IF(AND(D117=30,H117<>\"\"),$E$163,IF(AND(D117=50,H117<>\"\"),$H$163,\"\")))","v":""},{"$f":"IF(B117=\"\",\"\",IF(B117=Finals!$X$7,Berechnung!$H$162,\"\"))","v":""},{"$f":"IF(B117=\"\",\"\",IF(B117=Finals!$X$6,Berechnung!$H$161,\"\"))","v":""},{"$f":"IF(B117=\"\",\"\",IF(B117=Finals!$X$5,Berechnung!$H$160,\"\"))","v":""},{"$f":"IF(E117=Finals!$X$7,Berechnung!$H$162,\"\")","v":""},null,null,null,null,null,null,null,null,null,null,null,null,null,null,null,null,null,null,null,null,null,null,null,null,null,null,null,{"$f":"IF(B117=\"\",\"\",IF(B117=Finals!$X$4,Berechnung!$H$159,\"\"))","v":""},{"$f":"IFERROR(IF(B117=\"\",\"\",LARGE(Y117:BF117:BF117,1)),0)","v":0},{"$f":"IFERROR(IF(B117=\"\",\"\",IF(BG117<>0,V117+T117,IF(BG117=0,R117+T117+V117))),\"\")","v":55.007800000000003},{"$f":"IFERROR(BG117+BH117,\"\")","v":55.007800000000003},{"$f":"B117","v":"Brachmanski Dave"},2,{"$f":"IFERROR(LARGE($BI$116:$BJ$155,2),\"\")","v":350.00560000000002},"Jeroch Paul",null,{"$f":"IF(BM117=\"\",\"\",BK117)","v":2},{"$f":"BM117","v":"Jeroch Paul"},{"$f":"BL117","v":350.00560000000002},{"$f":"IF(BO117=\"\",\"\",($BQ$114-BO116)*4)","v":92},{"$f":"VLOOKUP(BP117,$B$116:$U$155,20,FALSE)","v":10},{"$f":"IF(BR117=\"\",\"\",BR117+BS117)","v":102}]
[{"$f":"Spieler!A4","v":3},{"$f":"Spieler!C4","v":"Brömel Frank"},null,50,0,{"$f":"IFERROR(IF(B118=\"\",\"\",VLOOKUP(B118,'2. Runde Gruppen'!$D$3:$H$20,5,FALSE)),\"\")","v":""},"","","",null,null,null,null,"","",null,{"$f":"IF(OR(F118<>\"\",G118<>\"\"),Berechnung!$H$164,D118)","v":50},50,null,3.8E-3,0,{"$f":"U118*5+T118","v":3.8E-3},{"$f":"IF(B118=\"\",\"\",V118+R118+X118)","v":100.0038},50,"","",{"$f":"IF(B118=\"\",\"\",IF(B118=Finals!$X$7,Berechnung!$H$162,\"\"))","v":""},{"$f":"IF(B118=\"\",\"\",IF(B118=Finals!$X$6,Berechnung!$H$161,\"\"))","v":""},{"$f":"IF(B118=\"\",\"\",IF(B118=Finals!$X$5,Berechnung!$H$160,\"\"))","v":""},{"$f":"IF(E118=Finals!$X$7,Berechnung!$H$162,\"\")","v":""},null,null,null,null,null,null,null,null,null,null,null,null,null,null,null,null,null,null,null,null,null,null,null,null,null,null,null,{"$f":"IF(B118=\"\",\"\",IF(B118=Finals!$X$4,Berechnung!$H$159,\"\"))","v":""},{"$f":"IFERROR(IF(B118=\"\",\"\",LARGE(Y118:BF118:BF118,1)),0)","v":0},50.007599999999996,{"$f":"IFERROR(BG118+BH118,\"\")","v":50.007599999999996},"Brömel Frank",3,{"$f":"IFERROR(LARGE($BI$116:$BJ$155,3),\"\")","v":275.00659999999999},"Fandrei Joel",null,3,"Fandrei Joel",275.00659999999999,{"$f":"IF(BO118=\"\",\"\",($BQ$114-BO117)*4)","v":88},9,97]
[{"$f":"Spieler!A5","v":4},{"$f":"Spieler!C5","v":"Delling Tino"},null,50,4,{"$f":"IFERROR(IF(B119=\"\",\"\",VLOOKUP(B119,'2. Runde Gruppen'!$D$3:$H$20,5,FALSE)),\"\")","v":0},2,1,"",null,null,null,null,"","",null,{"$f":"IF(OR(F119<>\"\",G119<>\"\"),Berechnung!$H$164,D119)","v":100},100,null,3.7000000000000002E-3,7,35.003700000000002,185.00370000000001,50,100,150,{"$f":"IF(B119=\"\",\"\",IF(B119=Finals!$X$7,Berechnung!$H$162,\"\"))","v":""},{"$f":"IF(B119=\"\",\"\",IF(B119=Finals!$X$6,Berechnung!$H$161,\"\"))","v":""},{"$f":"IF(B119=\"\",\"\",IF(B119=Finals!$X$5,Berechnung!$H$160,\"\"))","v":""},{"$f":"IF(E119=Finals!$X$7,Berechnung!$H$162,\"\")","v":""},null,null,null,null,null,null,null,null,null,null,null,null,null,null,null,null,null,null,null,null,null,null,null,null,null,null,null,{"$f":"IF(B119=\"\",\"\",IF(B119=Finals!$X$4,Berechnung!$H$159,\"\"))","v":""},{"$f":"IFERROR(IF(B119=\"\",\"\",LARGE(Y119:BF119:BF119,1)),0)","v":150},35.007400000000004,{"$f":"IFERROR(BG119+BH119,\"\")","v":185.00740000000002},"Delling Tino",4,{"$f":"IFERROR(LARGE($BI$116:$BJ$155,4),\"\")","v":260.0052},"Müller Marcus",null,4,"Müller Marcus",260.0052,84,6,90]
[{"$f":"Spieler!A6","v":5},{"$f":"Spieler!C6","v":"Drahn Robert"},null,50,2,{"$f":"IFERROR(IF(B120=\"\",\"\",VLOOKUP(B120,'2. Runde Gruppen'!$D$3:$H$20,5,FALSE)),\"\")","v":0},0,"","",null,null,null,null,"","",null,{"$f":"IF(OR(F120<>\"\",G120<>\"\"),Berechnung!$H$164,D120)","v":100},100,null,3.5999999999999999E-3,2,10.0036,160.00360000000001,50,100,"",{"$f":"IF(B120=\"\",\"\",IF(B120=Finals!$X$7,Berechnung!$H$162,\"\"))","v":""},{"$f":"IF(B120=\"\",\"\",IF(B120=Finals!$X$6,Berechnung!$H$161,\"\"))","v":""},{"$f":"IF(B120=\"\",\"\",IF(B120=Finals!$X$5,Berechnung!$H$160,\"\"))","v":""},{"$f":"IF(E120=Finals!$X$7,Berechnung!$H$162,\"\")","v":""},null,null,null,null,null,null,null,null,null,null,null,null,null,null,null,null,null,null,null,null,null,null,null,null,null,null,null,{"$f":"IF(B120=\"\",\"\",IF(B120=Finals!$X$4,Berechnung!$H$159,\"\"))","v":""},{"$f":"IFERROR(IF(B120=\"\",\"\",LARGE(Y120:BF120:BF120,1)),0)","v":100},10.007200000000001,{"$f":"IFERROR(BG120+BH120,\"\")","v":110.0072},"Drahn Robert",5,{"$f":"IFERROR(LARGE($BI$116:$BJ$155,5),\"\")","v":185.00740000000002},"Delling Tino",null,5,"Delling Tino",185.00740000000002,80,7,87]
[{"$f":"Spieler!A7","v":6},{"$f":"Spieler!C7","v":"Elham Faiz"},null,50,1,{"$f":"IFERROR(IF(B121=\"\",\"\",VLOOKUP(B121,'2. Runde Gruppen'!$D$3:$H$20,5,FALSE)),\"\")","v":""},"","","",null,null,null,null,"","",null,{"$f":"IF(OR(F121<>\"\",G121<>\"\"),Berechnung!$H$164,D121)","v":50},50,null,3.5000000000000001E-3,1,5.0034999999999998,105.0035,50,"","",{"$f":"IF(B121=\"\",\"\",IF(B121=Finals!$X$7,Berechnung!$H$162,\"\"))","v":""},{"$f":"IF(B121=\"\",\"\",IF(B121=Finals!$X$6,Berechnung!$H$161,\"\"))","v":""},{"$f":"IF(B121=\"\",\"\",IF(B121=Finals!$X$5,Berechnung!$H$160,\"\"))","v":""},{"$f":"IF(E121=Finals!$X$7,Berechnung!$H$162,\"\")","v":""},null,null,null,null,null,null,null,null,null,null,null,null,null,null,null,null,null,null,null,null,null,null,null,null,null,null,null,{"$f":"IF(B121=\"\",\"\",IF(B121=Finals!$X$4,Berechnung!$H$159,\"\"))","v":""},{"$f":"IFERROR(IF(B121=\"\",\"\",LARGE(Y121:BF121:BF121,1)),0)","v":0},55.007000000000005,{"$f":"IFERROR(BG121+BH121,\"\")","v":55.007000000000005},"Elham Faiz",6,{"$f":"IFERROR(LARGE($BI$116:$BJ$155,6),\"\")","v":185.00479999999999},"Stachly Marec",null,6,"Stachly Marec",185.00479999999999,76,7,83]
[{"$f":"Spieler!A8","v":7},{"$f":"Spieler!C8","v":"Fandrei Andreas"},null,50,2,{"$f":"IFERROR(IF(B122=\"\",\"\",VLOOKUP(B122,'2. Runde Gruppen'!$D$3:$H$20,5,FALSE)),\"\")","v":0},0,"","",null,null,null,null,"","",null,{"$f":"IF(OR(F122<>\"\",G122<>\"\"),Berechnung!$H$164,D122)","v":100},100,null,3.3999999999999998E-3,2,10.003399999999999,160.0034,50,100,"",{"$f":"IF(B122=\"\",\"\",IF(B122=Finals!$X$7,Berechnung!$H$162,\"\"))","v":""},{"$f":"IF(B122=\"\",\"\",IF(B122=Finals!$X$6,Berechnung!$H$161,\"\"))","v":""},{"$f":"IF(B122=\"\",\"\",IF(B122=Finals!$X$5,Berechnung!$H$160,\"\"))","v":""},{"$f":"IF(E122=Finals!$X$7,Berechnung!$H$162,\"\")","v":""},null,null,null,null,null,null,null,null,null,null,null,null,null,null,null,null,null,null,null,null,null,null,null,null,null,null,null,{"$f":"IF(B122=\"\",\"\",IF(B122=Finals!$X$4,Berechnung!$H$159,\"\"))","v":""},{"$f":"IFERROR(IF(B122=\"\",\"\",LARGE(Y122:BF122:BF122,1)),0)","v":100},10.006799999999998,110.0068,"Fandrei Andreas",7,{"$f":"IFERROR(LARGE($BI$116:$BJ$155,7),\"\")","v":180.00639999999999},"Gärtner David",null,7,"Gärtner David",180.00639999999999,72,6,78]
[{"$f":"Spieler!A9","v":8},{"$f":"Spieler!C9","v":"Fandrei Joel"},null,50,4,{"$f":"IFERROR(IF(B123=\"\",\"\",VLOOKUP(B123,'2. Runde Gruppen'!$D$3:$H$20,5,FALSE)),\"\")","v":""},2,2,1,null,null,null,null,0,"",null,{"$f":"IF(OR(F123<>\"\",G123<>\"\"),Berechnung!$H$164,D123)","v":100},100,null,3.3E-3,9,45.003300000000003,195.0033,50,100,150,{"$f":"IF(B123=\"\",\"\",IF(B123=Finals!$X$7,Berechnung!$H$162,\"\"))","v":230},{"$f":"IF(B123=\"\",\"\",IF(B123=Finals!$X$6,Berechnung!$H$161,\"\"))","v":""},{"$f":"IF(B123=\"\",\"\",IF(B123=Finals!$X$5,Berechnung!$H$160,\"\"))","v":""},{"$f":"IF(E123=Finals!$X$7,Berechnung!$H$162,\"\")","v":""},null,null,null,null,null,null,null,null,null,null,null,null,null,null,null,null,null,null,null,null,null,null,null,null,null,null,null,{"$f":"IF(B123=\"\",\"\",IF(B123=Finals!$X$4,Berechnung!$H$159,\"\"))","v":""},{"$f":"IFERROR(IF(B123=\"\",\"\",LARGE(Y123:BF123:BF123,1)),0)","v":230},45.006600000000006,275.00659999999999,"Fandrei Joel",8,{"$f":"IFERROR(LARGE($BI$116:$BJ$155,8),\"\")","v":175.00399999999999},"Thomas Moritz",null,8,"Thomas Moritz",175.00399999999999,68,5,73]
[{"$f":"Spieler!A10","v":9},{"$f":"Spieler!C10","v":"Gärtner David"},null,50,4,{"$f":"IFERROR(IF(B124=\"\",\"\",VLOOKUP(B124,'2. Runde Gruppen'!$D$3:$H$20,5,FALSE)),\"\")","v":0},2,0,"",null,null,null,null,"","",null,{"$f":"IF(OR(F124<>\"\",G124<>\"\"),Berechnung!$H$164,D124)","v":100},100,null,3.2000000000000002E-3,{"$f":"SUM(E124:O124)","v":6},{"$f":"U124*5+T124","v":30.0032},{"$f":"IF(B124=\"\",\"\",V124+R124+X124)","v":180.00319999999999},50,100,{"$f":"IF(AND(D124=20,H124<>\"\"),$D$163,IF(AND(D124=30,H124<>\"\"),$E$163,IF(AND(D124=50,H124<>\"\"),$H$163,\"\")))","v":150},{"$f":"IF(B124=\"\",\"\",IF(B124=Finals!$X$7,Berechnung!$H$162,\"\"))","v":""},{"$f":"IF(B124=\"\",\"\",IF(B124=Finals!$X$6,Berechnung!$H$161,\"\"))","v":""},{"$f":"IF(B124=\"\",\"\",IF(B124=Finals!$X$5,Berechnung!$H$160,\"\"))","v":""},{"$f":"IF(E124=Finals!$X$7,Berechnung!$H$162,\"\")","v":""},null,null,null,null,null,null,null,null,null,null,null,null,null,null,null,null,null,null,null,null,null,null,null,null,null,null,null,{"$f":"IF(B124=\"\",\"\",IF(B124=Finals!$X$4,Berechnung!$H$159,\"\"))","v":""},{"$f":"IFERROR(IF(B124=\"\",\"\",LARGE(Y124:BF124:BF124,1)),0)","v":150},30.006399999999999,180.00639999999999,"Gärtner David",9,{"$f":"IFERROR(LARGE($BI$116:$BJ$155,9),\"\")","v":125.00460000000001},"Straßburger Marko",null,9,"Straßburger Marko",125.00460000000001,64,5,69]
[{"$f":"Spieler!A11","v":10},{"$f":"Spieler!C11","v":"Hartung Andreas"},null,50,{"$f":"IF(B125=\"\",\"\",VLOOKUP(B125,$D$1:$H$83,5,FALSE))","v":1},{"$f":"IFERROR(IF(B125=\"\",\"\",VLOOKUP(B125,'2. Runde Gruppen'!$D$3:$H$20,5,FALSE)),\"\")","v":""},"","","",null,null,null,null,"","",null,{"$f":"IF(OR(F125<>\"\",G125<>\"\"),Berechnung!$H$164,D125)","v":50},50,null,3.0999999999999999E-3,1,5.0030999999999999,105.0031,50,"",{"$f":"IF(AND(D125=20,H125<>\"\"),$D$163,IF(AND(D125=30,H125<>\"\"),$E$163,IF(AND(D125=50,H125<>\"\"),$H$163,\"\")))","v":""},{"$f":"IF(B125=\"\",\"\",IF(B125=Finals!$X$7,Berechnung!$H$162,\"\"))","v":""},{"$f":"IF(B125=\"\",\"\",IF(B125=Finals!$X$6,Berechnung!$H$161,\"\"))","v":""},{"$f":"IF(B125=\"\",\"\",IF(B125=Finals!$X$5,Berechnung!$H$160,\"\"))","v":""},{"$f":"IF(E125=Finals!$X$7,Berechnung!$H$162,\"\")","v":""},null,null,null,null,null,null,null,null,null,null,null,null,null,null,null,null,null,null,null,null,null,null,null,null,null,null,null,{"$f":"IF(B125=\"\",\"\",IF(B125=Finals!$X$4,Berechnung!$H$159,\"\"))","v":""},{"$f":"IFERROR(IF(B125=\"\",\"\",LARGE(Y125:BF125:BF125,1)),0)","v":0},55.006200000000007,55.006200000000007,"Hartung Andreas",10,{"$f":"IFERROR(LARGE($BI$116:$BJ$155,10),\"\")","v":120.0044},"Suttner Magnus",null,10,"Suttner Magnus",120.0044,60,4,64]
[{"$f":"Spieler!A12","v":11},{"$f":"Spieler!C12","v":"Hofmann Frank"},null,50,2,{"$f":"IFERROR(IF(B126=\"\",\"\",VLOOKUP(B126,'2. Runde Gruppen'!$D$3:$H$20,5,FALSE)),\"\")","v":""},0,"","",null,null,null,null,"","",null,{"$f":"IF(OR(F126<>\"\",G126<>\"\"),Berechnung!$H$164,D126)","v":100},100,null,3.0000000000000001E-3,2,10.003,160.00299999999999,50,100,"",{"$f":"IF(B126=\"\",\"\",IF(B126=Finals!$X$7,Berechnung!$H$162,\"\"))","v":""},{"$f":"IF(B126=\"\",\"\",IF(B126=Finals!$X$6,Berechnung!$H$161,\"\"))","v":""},{"$f":"IF(B126=\"\",\"\",IF(B126=Finals!$X$5,Berechnung!$H$160,\"\"))","v":""},{"$f":"IF(E126=Finals!$X$7,Berechnung!$H$162,\"\")","v":""},null,null,null,null,null,null,null,null,null,null,null,null,null,null,null,null,null,null,null,null,null,null,null,null,null,null,null,{"$f":"IF(B126=\"\",\"\",IF(B126=Finals!$X$4,Berechnung!$H$159,\"\"))","v":""},{"$f":"IFERROR(IF(B126=\"\",\"\",LARGE(Y126:BF126:BF126,1)),0)","v":100},10.006,110.006,"Hofmann Frank",11,{"$f":"IFERROR(LARGE($BI$116:$BJ$155,11),\"\")","v":120.0038},"Valderrama Salvador",null,11,"Valderrama Salvador",120.0038,56,4,60]
[{"$f":"Spieler!A13","v":12},{"$f":"Spieler!C13","v":"Isermann Rene"},null,50,0,{"$f":"IFERROR(IF(B127=\"\",\"\",VLOOKUP(B127,'2. Runde Gruppen'!$D$3:$H$20,5,FALSE)),\"\")","v":""},"","","",null,null,null,null,"","",null,{"$f":"IF(OR(F127<>\"\",G127<>\"\"),Berechnung!$H$164,D127)","v":50},50,null,2.8999999999999998E-3,0,2.8999999999999998E-3,100.0029,50,"","",{"$f":"IF(B127=\"\",\"\",IF(B127=Finals!$X$7,Berechnung!$H$162,\"\"))","v":""},{"$f":"IF(B127=\"\",\"\",IF(B127=Finals!$X$6,Berechnung!$H$161,\"\"))","v":""},{"$f":"IF(B127=\"\",\"\",IF(B127=Finals!$X$5,Berechnung!$H$160,\"\"))","v":""},{"$f":"IF(E127=Finals!$X$7,Berechnung!$H$162,\"\")","v":""},null,null,null,null,null,null,null,null,null,null,null,null,null,null,null,null,null,null,null,null,null,null,null,null,null,null,null,{"$f":"IF(B127=\"\",\"\",IF(B127=Finals!$X$4,Berechnung!$H$159,\"\"))","v":""},{"$f":"IFERROR(IF(B127=\"\",\"\",LARGE(Y127:BF127:BF127,1)),0)","v":0},50.005799999999994,50.005799999999994,"Isermann Rene",12,{"$f":"IFERROR(LARGE($BI$116:$BJ$155,12),\"\")","v":120.0034},"Witzik Oliver",null,12,"Witzik Oliver",120.0034,52,4,56]
[{"$f":"Spieler!A14","v":13},{"$f":"Spieler!C14","v":"Jeroch Paul"},null,50,4,{"$f":"IFERROR(IF(B128=\"\",\"\",VLOOKUP(B128,'2. Runde Gruppen'!$D$3:$H$20,5,FALSE)),\"\")","v":0},2,2,2,null,null,null,null,"",0,null,{"$f":"IF(OR(F128<>\"\",G128<>\"\"),Berechnung!$H$164,D128)","v":100},100,null,2.8E-3,10,50.002800000000001,200.00280000000001,50,100,150,{"$f":"IF(B128=\"\",\"\",IF(B128=Finals!$X$7,Berechnung!$H$162,\"\"))","v":""},{"$f":"IF(B128=\"\",\"\",IF(B128=Finals!$X$6,Berechnung!$H$161,\"\"))","v":""},{"$f":"IF(B128=\"\",\"\",IF(B128=Finals!$X$5,Berechnung!$H$160,\"\"))","v":300},{"$f":"IF(E128=Finals!$X$7,Berechnung!$H$162,\"\")","v":""},null,null,null,null,null,null,null,null,null,null,null,null,null,null,null,null,null,null,null,null,null,null,null,null,null,null,null,{"$f":"IF(B128=\"\",\"\",IF(B128=Finals!$X$4,Berechnung!$H$159,\"\"))","v":""},{"$f":"IFERROR(IF(B128=\"\",\"\",LARGE(Y128:BF128:BF128,1)),0)","v":300},50.005600000000001,350.00560000000002,"Jeroch Paul",13,{"$f":"IFERROR(LARGE($BI$116:$BJ$155,13),\"\")","v":110.008},"Behling Oliver",null,13,"Behling Oliver",110.008,48,2,50]
[{"$f":"Spieler!A15","v":14},{"$f":"Spieler!C15","v":"Löffel Ulrich"},null,50,0,{"$f":"IFERROR(IF(B129=\"\",\"\",VLOOKUP(B129,'2. Runde Gruppen'!$D$3:$H$20,5,FALSE)),\"\")","v":""},"","","",null,null,null,null,"","",null,{"$f":"IF(OR(F129<>\"\",G129<>\"\"),Berechnung!$H$164,D129)","v":50},50,null,2.7000000000000001E-3,0,2.7000000000000001E-3,100.0027,50,"","",{"$f":"IF(B129=\"\",\"\",IF(B129=Finals!$X$7,Berechnung!$H$162,\"\"))","v":""},{"$f":"IF(B129=\"\",\"\",IF(B129=Finals!$X$6,Berechnung!$H$161,\"\"))","v":""},{"$f":"IF(B129=\"\",\"\",IF(B129=Finals!$X$5,Berechnung!$H$160,\"\"))","v":""},{"$f":"IF(E129=Finals!$X$7,Berechnung!$H$162,\"\")","v":""},null,null,null,null,null,null,null,null,null,null,null,null,null,null,null,null,null,null,null,null,null,null,null,null,null,null,null,{"$f":"IF(B129=\"\",\"\",IF(B129=Finals!$X$4,Berechnung!$H$159,\"\"))","v":""},{"$f":"IFERROR(IF(B129=\"\",\"\",LARGE(Y129:BF129:BF129,1)),0)","v":0},50.005399999999995,50.005399999999995,"Löffel Ulrich",14,{"$f":"IFERROR(LARGE($BI$116:$BJ$155,14),\"\")","v":110.0072},"Drahn Robert",null,14,"Drahn Robert",110.0072,44,2,46]
[{"$f":"Spieler!A16","v":15},{"$f":"Spieler!C16","v":"Müller Marcus"},null,50,2,{"$f":"IFERROR(IF(B130=\"\",\"\",VLOOKUP(B130,'2. Runde Gruppen'!$D$3:$H$20,5,FALSE)),\"\")","v":0},2,2,0,null,null,null,null,0,"",null,{"$f":"IF(OR(F130<>\"\",G130<>\"\"),Berechnung!$H$164,D130)","v":100},100,null,2.5999999999999999E-3,6,30.002600000000001,180.0026,50,100,150,{"$f":"IF(B130=\"\",\"\",IF(B130=Finals!$X$7,Berechnung!$H$162,\"\"))","v":""},{"$f":"IF(B130=\"\",\"\",IF(B130=Finals!$X$6,Berechnung!$H$161,\"\"))","v":230},{"$f":"IF(B130=\"\",\"\",IF(B130=Finals!$X$5,Berechnung!$H$160,\"\"))","v":""},{"$f":"IF(E130=Finals!$X$7,Berechnung!$H$162,\"\")","v":""},null,null,null,null,null,null,null,null,null,null,null,null,null,null,null,null,null,null,null,null,null,null,null,null,null,null,null,{"$f":"IF(B130=\"\",\"\",IF(B130=Finals!$X$4,Berechnung!$H$159,\"\"))","v":""},{"$f":"IFERROR(IF(B130=\"\",\"\",LARGE(Y130:BF130:BF130,1)),0)","v":230},30.005200000000002,260.0052,"Müller Marcus",15,{"$f":"IFERROR(LARGE($BI$116:$BJ$155,15),\"\")","v":110.0068},"Fandrei Andreas",null,15,"Fandrei Andreas",110.0068,40,2,42]
[{"$f":"Spieler!A17","v":16},{"$f":"Spieler!C17","v":"Rejke Ronny"},null,50,1,{"$f":"IFERROR(IF(B131=\"\",\"\",VLOOKUP(B131,'2. Runde Gruppen'!$D$3:$H$20,5,FALSE)),\"\")","v":""},"","","",null,null,null,null,"","",null,{"$f":"IF(OR(F131<>\"\",G131<>\"\"),Berechnung!$H$164,D131)","v":50},50,null,2.5000000000000001E-3,1,5.0025000000000004,105.0025,50,"","",{"$f":"IF(B131=\"\",\"\",IF(B131=Finals!$X$7,Berechnung!$H$162,\"\"))","v":""},{"$f":"IF(B131=\"\",\"\",IF(B131=Finals!$X$6,Berechnung!$H$161,\"\"))","v":""},{"$f":"IF(B131=\"\",\"\",IF(B131=Finals!$X$5,Berechnung!$H$160,\"\"))","v":""},{"$f":"IF(E131=Finals!$X$7,Berechnung!$H$162,\"\")","v":""},null,null,null,null,null,null,null,null,null,null,null,null,null,null,null,null,null,null,null,null,null,null,null,null,null,null,null,{"$f":"IF(B131=\"\",\"\",IF(B131=Finals!$X$4,Berechnung!$H$159,\"\"))","v":""},{"$f":"IFERROR(IF(B131=\"\",\"\",LARGE(Y131:BF131:BF131,1)),0)","v":0},55.004999999999995,{"$f":"IFERROR(BG131+BH131,\"\")","v":55.004999999999995},"Rejke Ronny",16,{"$f":"IFERROR(LARGE($BI$116:$BJ$155,16),\"\")","v":110.006},"Hofmann Frank",null,16,"Hofmann Frank",{"$f":"BL131","v":110.006},36,2,38]
[{"$f":"Spieler!A18","v":17},{"$f":"Spieler!C18","v":"Stachly Marec"},null,50,4,{"$f":"IFERROR(IF(B132=\"\",\"\",VLOOKUP(B132,'2. Runde Gruppen'!$D$3:$H$20,5,FALSE)),\"\")","v":""},2,1,"",null,null,null,null,"","",null,{"$f":"IF(OR(F132<>\"\",G132<>\"\"),Berechnung!$H$164,D132)","v":100},100,null,2.3999999999999998E-3,7,35.002400000000002,185.00239999999999,50,100,150,{"$f":"IF(B132=\"\",\"\",IF(B132=Finals!$X$7,Berechnung!$H$162,\"\"))","v":""},{"$f":"IF(B132=\"\",\"\",IF(B132=Finals!$X$6,Berechnung!$H$161,\"\"))","v":""},{"$f":"IF(B132=\"\",\"\",IF(B132=Finals!$X$5,Berechnung!$H$160,\"\"))","v":""},{"$f":"IF(E132=Finals!$X$7,Berechnung!$H$162,\"\")","v":""},null,null,null,null,null,null,null,null,null,null,null,null,null,null,null,null,null,null,null,null,null,null,null,null,null,null,null,{"$f":"IF(B132=\"\",\"\",IF(B132=Finals!$X$4,Berechnung!$H$159,\"\"))","v":""},{"$f":"IFERROR(IF(B132=\"\",\"\",LARGE(Y132:BF132:BF132,1)),0)","v":150},35.004800000000003,185.00479999999999,"Stachly Marec",17,{"$f":"IFERROR(LARGE($BI$116:$BJ$155,17),\"\")","v":55.007800000000003},"Brachmanski Dave",null,17,"Brachmanski Dave",55.007800000000003,32,1,33]
[{"$f":"Spieler!A19","v":18},{"$f":"Spieler!C19","v":"Straßburger Marko"},null,50,4,{"$f":"IFERROR(IF(B133=\"\",\"\",VLOOKUP(B133,'2. Runde Gruppen'!$D$3:$H$20,5,FALSE)),\"\")","v":0},1,"","",null,null,null,null,"","",null,{"$f":"IF(OR(F133<>\"\",G133<>\"\"),Berechnung!$H$164,D133)","v":100},100,null,2.3E-3,5,25.002300000000002,175.00229999999999,50,100,"",{"$f":"IF(B133=\"\",\"\",IF(B133=Finals!$X$7,Berechnung!$H$162,\"\"))","v":""},{"$f":"IF(B133=\"\",\"\",IF(B133=Finals!$X$6,Berechnung!$H$161,\"\"))","v":""},{"$f":"IF(B133=\"\",\"\",IF(B133=Finals!$X$5,Berechnung!$H$160,\"\"))","v":""},{"$f":"IF(E133=Finals!$X$7,Berechnung!$H$162,\"\")","v":""},null,null,null,null,null,null,null,null,null,null,null,null,null,null,null,null,null,null,null,null,null,null,null,null,null,null,null,{"$f":"IF(B133=\"\",\"\",IF(B133=Finals!$X$4,Berechnung!$H$159,\"\"))","v":""},{"$f":"IFERROR(IF(B133=\"\",\"\",LARGE(Y133:BF133:BF133,1)),0)","v":100},25.004600000000003,125.00460000000001,"Straßburger Marko",18,{"$f":"IFERROR(LARGE($BI$116:$BJ$155,18),\"\")","v":55.007000000000005},"Elham Faiz",null,18,"Elham Faiz",55.007000000000005,28,1,29]
[{"$f":"Spieler!A20","v":19},{"$f":"Spieler!C20","v":"Suttner Magnus"},null,50,3,{"$f":"IFERROR(IF(B134=\"\",\"\",VLOOKUP(B134,'2. Runde Gruppen'!$D$3:$H$20,5,FALSE)),\"\")","v":0},1,"","",null,null,null,null,"","",null,{"$f":"IF(OR(F134<>\"\",G134<>\"\"),Berechnung!$H$164,D134)","v":100},100,null,2.2000000000000001E-3,4,20.002199999999998,170.00220000000002,50,100,"",{"$f":"IF(B134=\"\",\"\",IF(B134=Finals!$X$7,Berechnung!$H$162,\"\"))","v":""},{"$f":"IF(B134=\"\",\"\",IF(B134=Finals!$X$6,Berechnung!$H$161,\"\"))","v":""},{"$f":"IF(B134=\"\",\"\",IF(B134=Finals!$X$5,Berechnung!$H$160,\"\"))","v":""},{"$f":"IF(E134=Finals!$X$7,Berechnung!$H$162,\"\")","v":""},null,null,null,null,null,null,null,null,null,null,null,null,null,null,null,null,null,null,null,null,null,null,null,null,null,null,null,{"$f":"IF(B134=\"\",\"\",IF(B134=Finals!$X$4,Berechnung!$H$159,\"\"))","v":""},{"$f":"IFERROR(IF(B134=\"\",\"\",LARGE(Y134:BF134:BF134,1)),0)","v":100},20.004399999999997,120.0044,"Suttner Magnus",19,{"$f":"IFERROR(LARGE($BI$116:$BJ$155,19),\"\")","v":55.006200000000007},"Hartung Andreas",null,19,"Hartung Andreas",55.006200000000007,24,1,25]
[{"$f":"Spieler!A21","v":20},{"$f":"Spieler!C21","v":"Swennen Andy"},null,50,0,{"$f":"IFERROR(IF(B135=\"\",\"\",VLOOKUP(B135,'2. Runde Gruppen'!$D$3:$H$20,5,FALSE)),\"\")","v":""},"","","",null,null,null,null,"","",null,{"$f":"IF(OR(F135<>\"\",G135<>\"\"),Berechnung!$H$164,D135)","v":50},50,null,2.0999999999999999E-3,0,2.0999999999999999E-3,100.0021,50,{"$f":"IF(AND(D135=30,G135<>\"\"),$E$164,IF(AND(D135=50,G135<>\"\"),$H$164,\"\"))","v":""},"",{"$f":"IF(B135=\"\",\"\",IF(B135=Finals!$X$7,Berechnung!$H$162,\"\"))","v":""},{"$f":"IF(B135=\"\",\"\",IF(B135=Finals!$X$6,Berechnung!$H$161,\"\"))","v":""},{"$f":"IF(B135=\"\",\"\",IF(B135=Finals!$X$5,Berechnung!$H$160,\"\"))","v":""},{"$f":"IF(E135=Finals!$X$7,Berechnung!$H$162,\"\")","v":""},null,null,null,null,null,null,null,null,null,null,null,null,null,null,null,null,null,null,null,null,null,null,null,null,null,null,null,{"$f":"IF(B135=\"\",\"\",IF(B135=Finals!$X$4,Berechnung!$H$159,\"\"))","v":""},{"$f":"IFERROR(IF(B135=\"\",\"\",LARGE(Y135:BF135:BF135,1)),0)","v":0},50.004199999999997,50.004199999999997,"Swennen Andy",20,{"$f":"IFERROR(LARGE($BI$116:$BJ$155,20),\"\")","v":55.004999999999995},"Rejke Ronny",null,20,"Rejke Ronny",55.004999999999995,20,1,21]
[{"$f":"Spieler!A22","v":21},{"$f":"Spieler!C22","v":"Thomas Moritz"},null,50,3,{"$f":"IFERROR(IF(B136=\"\",\"\",VLOOKUP(B136,'2. Runde Gruppen'!$D$3:$H$20,5,FALSE)),\"\")","v":""},{"$f":"IFERROR(VLOOKUP(B136,$D$90:$E$113,2,FALSE),\"\")","v":2},0,"",null,null,null,null,"","",null,{"$f":"IF(OR(F136<>\"\",G136<>\"\"),Berechnung!$H$164,D136)","v":100},100,null,1.9999999999999901E-3,5,25.001999999999999,175.00200000000001,50,{"$f":"IF(AND(D136=30,G136<>\"\"),$E$164,IF(AND(D136=50,G136<>\"\"),$H$164,\"\"))","v":100},150,{"$f":"IF(B136=\"\",\"\",IF(B136=Finals!$X$7,Berechnung!$H$162,\"\"))","v":""},{"$f":"IF(B136=\"\",\"\",IF(B136=Finals!$X$6,Berechnung!$H$161,\"\"))","v":""},{"$f":"IF(B136=\"\",\"\",IF(B136=Finals!$X$5,Berechnung!$H$160,\"\"))","v":""},{"$f":"IF(E136=Finals!$X$7,Berechnung!$H$162,\"\")","v":""},null,null,null,null,null,null,null,null,null,null,null,null,null,null,null,null,null,null,null,null,null,null,null,null,null,null,null,{"$f":"IF(B136=\"\",\"\",IF(B136=Finals!$X$4,Berechnung!$H$159,\"\"))","v":""},{"$f":"IFERROR(IF(B136=\"\",\"\",LARGE(Y136:BF136:BF136,1)),0)","v":150},25.003999999999998,{"$f":"IFERROR(BG136+BH136,\"\")","v":175.00399999999999},"Thomas Moritz",21,{"$f":"IFERROR(LARGE($BI$116:$BJ$155,21),\"\")","v":50.007599999999996},"Brömel Frank",null,21,"Brömel Frank",50.007599999999996,16,0,16]
[{"$f":"Spieler!A23","v":22},{"$f":"Spieler!C23","v":"Valderrama Salvador"},null,50,3,{"$f":"IFERROR(IF(B137=\"\",\"\",VLOOKUP(B137,'2. Runde Gruppen'!$D$3:$H$20,5,FALSE)),\"\")","v":0},1,"","",null,null,null,null,"","",null,{"$f":"IF(OR(F137<>\"\",G137<>\"\"),Berechnung!$H$164,D137)","v":100},100,null,1.89999999999999E-3,4,20.001899999999999,170.00190000000001,50,100,"",{"$f":"IF(B137=\"\",\"\",IF(B137=Finals!$X$7,Berechnung!$H$162,\"\"))","v":""},{"$f":"IF(B137=\"\",\"\",IF(B137=Finals!$X$6,Berechnung!$H$161,\"\"))","v":""},{"$f":"IF(B137=\"\",\"\",IF(B137=Finals!$X$5,Berechnung!$H$160,\"\"))","v":""},{"$f":"IF(E137=Finals!$X$7,Berechnung!$H$162,\"\")","v":""},null,null,null,null,null,null,null,null,null,null,null,null,null,null,null,null,null,null,null,null,null,null,null,null,null,null,null,{"$f":"IF(B137=\"\",\"\",IF(B137=Finals!$X$4,Berechnung!$H$159,\"\"))","v":""},{"$f":"IFERROR(IF(B137=\"\",\"\",LARGE(Y137:BF137:BF137,1)),0)","v":100},20.003799999999998,120.0038,"Valderrama Salvador",22,{"$f":"IFERROR(LARGE($BI$116:$BJ$155,22),\"\")","v":50.005799999999994},"Isermann Rene",null,22,"Isermann Rene",50.005799999999994,12,0,12]
[{"$f":"Spieler!A24","v":23},{"$f":"Spieler!C24","v":"Weber Marco"},null,50,4,{"$f":"IFERROR(IF(B138=\"\",\"\",VLOOKUP(B138,'2. Runde Gruppen'!$D$3:$H$20,5,FALSE)),\"\")","v":0},2,2,2,null,null,null,null,"",2,null,{"$f":"IF(OR(F138<>\"\",G138<>\"\"),Berechnung!$H$164,D138)","v":100},100,null,1.79999999999999E-3,12,60.001800000000003,210.0018,50,100,150,{"$f":"IF(B138=\"\",\"\",IF(B138=Finals!$X$7,Berechnung!$H$162,\"\"))","v":""},{"$f":"IF(B138=\"\",\"\",IF(B138=Finals!$X$6,Berechnung!$H$161,\"\"))","v":""},{"$f":"IF(B138=\"\",\"\",IF(B138=Finals!$X$5,Berechnung!$H$160,\"\"))","v":""},{"$f":"IF(E138=Finals!$X$7,Berechnung!$H$162,\"\")","v":""},null,null,null,null,null,null,null,null,null,null,null,null,null,null,null,null,null,null,null,null,null,null,null,null,null,null,null,{"$f":"IF(B138=\"\",\"\",IF(B138=Finals!$X$4,Berechnung!$H$159,\"\"))","v":350},{"$f":"IFERROR(IF(B138=\"\",\"\",LARGE(Y138:BF138:BF138,1)),0)","v":350},60.003600000000006,410.00360000000001,"Weber Marco",23,{"$f":"IFERROR(LARGE($BI$116:$BJ$155,23),\"\")","v":50.005399999999995},"Löffel Ulrich",null,23,"Löffel Ulrich",50.005399999999995,8,0,8]
[{"$f":"Spieler!A25","v":24},{"$f":"Spieler!C25","v":"Witzik Oliver"},null,50,4,{"$f":"IFERROR(IF(B139=\"\",\"\",VLOOKUP(B139,'2. Runde Gruppen'!$D$3:$H$20,5,FALSE)),\"\")","v":0},0,"","",null,null,null,null,"","",null,{"$f":"IF(OR(F139<>\"\",G139<>\"\"),Berechnung!$H$164,D139)","v":100},100,null,1.6999999999999899E-3,4,20.0017,170.0017,50,100,"",{"$f":"IF(B139=\"\",\"\",IF(B139=Finals!$X$7,Berechnung!$H$162,\"\"))","v":""},{"$f":"IF(B139=\"\",\"\",IF(B139=Finals!$X$6,Berechnung!$H$161,\"\"))","v":""},{"$f":"IF(B139=\"\",\"\",IF(B139=Finals!$X$5,Berechnung!$H$160,\"\"))","v":""},{"$f":"IF(E139=Finals!$X$7,Berechnung!$H$162,\"\")","v":""},null,null,null,null,null,null,null,null,null,null,null,null,null,null,null,null,null,null,null,null,null,null,null,null,null,null,null,{"$f":"IF(B139=\"\",\"\",IF(B139=Finals!$X$4,Berechnung!$H$159,\"\"))","v":""},{"$f":"IFERROR(IF(B139=\"\",\"\",LARGE(Y139:BF139:BF139,1)),0)","v":100},20.003399999999999,120.0034,"Witzik Oliver",24,{"$f":"IFERROR(LARGE($BI$116:$BJ$155,24),\"\")","v":50.004199999999997},"Swennen Andy",null,24,"Swennen Andy",50.004199999999997,4,0,4]
[{"$f":"Spieler!A26","v":25},{"$f":"Spieler!C26","v":""},null,"",{"$f":"IF(B140=\"\",\"\",VLOOKUP(B140,$D$1:$H$83,5,FALSE))","v":""},{"$f":"IFERROR(IF(B140=\"\",\"\",VLOOKUP(B140,'2. Runde Gruppen'!$D$3:$H$20,5,FALSE)),\"\")","v":""},"","","",null,null,null,null,"","",null,{"$f":"IF(OR(F140<>\"\",G140<>\"\"),Berechnung!$H$164,D140)","v":""},"",null,1.5999999999999901E-3,0,1.5999999999999901E-3,"","","","",{"$f":"IF(B140=\"\",\"\",IF(B140=Finals!$X$7,Berechnung!$H$162,\"\"))","v":""},{"$f":"IF(B140=\"\",\"\",IF(B140=Finals!$X$6,Berechnung!$H$161,\"\"))","v":""},{"$f":"IF(B140=\"\",\"\",IF(B140=Finals!$X$5,Berechnung!$H$160,\"\"))","v":""},{"$f":"IF(E140=Finals!$X$7,Berechnung!$H$162,\"\")","v":""},null,null,null,null,null,null,null,null,null,null,null,null,null,null,null,null,null,null,null,null,null,null,null,null,null,null,null,{"$f":"IF(B140=\"\",\"\",IF(B140=Finals!$X$4,Berechnung!$H$159,\"\"))","v":""},{"$f":"IFERROR(IF(B140=\"\",\"\",LARGE(Y140:BF140:BF140,1)),0)","v":""},"","","",{"$f":"IF(B140=\"\",\"\",A140)","v":""},{"$f":"IFERROR(LARGE($BI$116:$BJ$155,25),\"\")","v":""},"",null,"","","","",0,""]
[{"$f":"Spieler!A27","v":26},{"$f":"Spieler!C27","v":""},null,"",{"$f":"IF(B141=\"\",\"\",VLOOKUP(B141,$D$1:$H$83,5,FALSE))","v":""},{"$f":"IFERROR(IF(B141=\"\",\"\",VLOOKUP(B141,'2. Runde Gruppen'!$D$3:$H$20,5,FALSE)),\"\")","v":""},"","","",null,null,null,null,"","",null,{"$f":"IF(OR(F141<>\"\",G141<>\"\"),Berechnung!$H$164,D141)","v":""},{"$f":"IF(Q141<>\"\",Q141,D141)","v":""},null,1.4999999999999901E-3,0,1.4999999999999901E-3,"","","","",{"$f":"IF(B141=\"\",\"\",IF(B141=Finals!$X$7,Berechnung!$H$162,\"\"))","v":""},{"$f":"IF(B141=\"\",\"\",IF(B141=Finals!$X$6,Berechnung!$H$161,\"\"))","v":""},{"$f":"IF(B141=\"\",\"\",IF(B141=Finals!$X$5,Berechnung!$H$160,\"\"))","v":""},{"$f":"IF(E141=Finals!$X$7,Berechnung!$H$162,\"\")","v":""},null,null,null,null,null,null,null,null,null,null,null,null,null,null,null,null,null,null,null,null,null,null,null,null,null,null,null,{"$f":"IF(B141=\"\",\"\",IF(B141=Finals!$X$4,Berechnung!$H$159,\"\"))","v":""},{"$f":"IFERROR(IF(B141=\"\",\"\",LARGE(Y141:BF141:BF141,1)),0)","v":""},"","","",{"$f":"IF(B141=\"\",\"\",A141)","v":""},{"$f":"IFERROR(LARGE($BI$116:$BJ$155,26),\"\")","v":""},"",null,"","","","",0,""]
[{"$f":"Spieler!A28","v":27},{"$f":"Spieler!C28","v":""},null,"","",{"$f":"IFERROR(IF(B142=\"\",\"\",VLOOKUP(B142,'2. Runde Gruppen'!$D$3:$H$20,5,FALSE)),\"\")","v":""},"","","",null,null,null,null,"","",null,{"$f":"IF(OR(F142<>\"\",G142<>\"\"),Berechnung!$H$164,D142)","v":""},"",null,1.39999999999999E-3,0,1.39999999999999E-3,"","","","",{"$f":"IF(B142=\"\",\"\",IF(B142=Finals!$X$7,Berechnung!$H$162,\"\"))","v":""},{"$f":"IF(B142=\"\",\"\",IF(B142=Finals!$X$6,Berechnung!$H$161,\"\"))","v":""},{"$f":"IF(B142=\"\",\"\",IF(B142=Finals!$X$5,Berechnung!$H$160,\"\"))","v":""},{"$f":"IF(E142=Finals!$X$7,Berechnung!$H$162,\"\")","v":""},null,null,null,null,null,null,null,null,null,null,null,null,null,null,null,null,null,null,null,null,null,null,null,null,null,null,null,{"$f":"IF(B142=\"\",\"\",IF(B142=Finals!$X$4,Berechnung!$H$159,\"\"))","v":""},{"$f":"IFERROR(IF(B142=\"\",\"\",LARGE(Y142:BF142:BF142,1)),0)","v":""},"","","","",{"$f":"IFERROR(LARGE($BI$116:$BJ$155,27),\"\")","v":""},"",null,"","","","",0,""]
[{"$f":"Spieler!A29","v":28},{"$f":"Spieler!C29","v":""},null,"","",{"$f":"IFERROR(IF(B143=\"\",\"\",VLOOKUP(B143,'2. Runde Gruppen'!$D$3:$H$20,5,FALSE)),\"\")","v":""},"","","",null,null,null,null,"","",null,{"$f":"IF(OR(F143<>\"\",G143<>\"\"),Berechnung!$H$164,D143)","v":""},"",null,1.29999999999999E-3,0,1.29999999999999E-3,"","","","",{"$f":"IF(B143=\"\",\"\",IF(B143=Finals!$X$7,Berechnung!$H$162,\"\"))","v":""},{"$f":"IF(B143=\"\",\"\",IF(B143=Finals!$X$6,Berechnung!$H$161,\"\"))","v":""},{"$f":"IF(B143=\"\",\"\",IF(B143=Finals!$X$5,Berechnung!$H$160,\"\"))","v":""},{"$f":"IF(E143=Finals!$X$7,Berechnung!$H$162,\"\")","v":""},null,null,null,null,null,null,null,null,null,null,null,null,null,null,null,null,null,null,null,null,null,null,null,null,null,null,null,{"$f":"IF(B143=\"\",\"\",IF(B143=Finals!$X$4,Berechnung!$H$159,\"\"))","v":""},{"$f":"IFERROR(IF(B143=\"\",\"\",LARGE(Y143:BF143:BF143,1)),0)","v":""},"","","","",{"$f":"IFERROR(LARGE($BI$116:$BJ$155,28),\"\")","v":""},"",null,"","","","",0,""]
[{"$f":"Spieler!A30","v":29},{"$f":"Spieler!C30","v":""},null,"","",{"$f":"IFERROR(IF(B144=\"\",\"\",VLOOKUP(B144,'2. Runde Gruppen'!$D$3:$H$20,5,FALSE)),\"\")","v":""},"","","",null,null,null,null,"","",null,{"$f":"IF(OR(F144<>\"\",G144<>\"\"),Berechnung!$H$164,D144)","v":""},"",null,1.1999999999999899E-3,0,1.1999999999999899E-3,"","","","",{"$f":"IF(B144=\"\",\"\",IF(B144=Finals!$X$7,Berechnung!$H$162,\"\"))","v":""},{"$f":"IF(B144=\"\",\"\",IF(B144=Finals!$X$6,Berechnung!$H$161,\"\"))","v":""},{"$f":"IF(B144=\"\",\"\",IF(B144=Finals!$X$5,Berechnung!$H$160,\"\"))","v":""},{"$f":"IF(E144=Finals!$X$7,Berechnung!$H$162,\"\")","v":""},null,null,null,null,null,null,null,null,null,null,null,null,null,null,null,null,null,null,null,null,null,null,null,null,null,null,null,{"$f":"IF(B144=\"\",\"\",IF(B144=Finals!$X$4,Berechnung!$H$159,\"\"))","v":""},{"$f":"IFERROR(IF(B144=\"\",\"\",LARGE(Y144:BF144:BF144,1)),0)","v":""},"","","","",{"$f":"IFERROR(LARGE($BI$116:$BJ$155,29),\"\")","v":""},"",null,"","","","",0,""]
[{"$f":"Spieler!A31","v":30},{"$f":"Spieler!C31","v":""},null,"","",{"$f":"IFERROR(IF(B145=\"\",\"\",VLOOKUP(B145,'2. Runde Gruppen'!$D$3:$H$20,5,FALSE)),\"\")","v":""},"","","",null,null,null,null,"","",null,{"$f":"IF(OR(F145<>\"\",G145<>\"\"),Berechnung!$H$164,D145)","v":""},"",null,1.0999999999999901E-3,0,1.0999999999999901E-3,"","","","",{"$f":"IF(B145=\"\",\"\",IF(B145=Finals!$X$7,Berechnung!$H$162,\"\"))","v":""},{"$f":"IF(B145=\"\",\"\",IF(B145=Finals!$X$6,Berechnung!$H$161,\"\"))","v":""},{"$f":"IF(B145=\"\",\"\",IF(B145=Finals!$X$5,Berechnung!$H$160,\"\"))","v":""},{"$f":"IF(E145=Finals!$X$7,Berechnung!$H$162,\"\")","v":""},null,null,null,null,null,null,null,null,null,null,null,null,null,null,null,null,null,null,null,null,null,null,null,null,null,null,null,{"$f":"IF(B145=\"\",\"\",IF(B145=Finals!$X$4,Berechnung!$H$159,\"\"))","v":""},{"$f":"IFERROR(IF(B145=\"\",\"\",LARGE(Y145:BF145:BF145,1)),0)","v":""},"","","","",{"$f":"IFERROR(LARGE($BI$116:$BJ$155,30),\"\")","v":""},"",null,"","","","",0,""]
[{"$f":"Spieler!A32","v":31},{"$f":"Spieler!C32","v":""},null,"","",{"$f":"IFERROR(IF(B146=\"\",\"\",VLOOKUP(B146,'2. Runde Gruppen'!$D$3:$H$20,5,FALSE)),\"\")","v":""},"","","",null,null,null,null,"","",null,{"$f":"IF(OR(F146<>\"\",G146<>\"\"),Berechnung!$H$164,D146)","v":""},"",null,9.9999999999999005E-4,0,9.9999999999999005E-4,"","","","",{"$f":"IF(B146=\"\",\"\",IF(B146=Finals!$X$7,Berechnung!$H$162,\"\"))","v":""},{"$f":"IF(B146=\"\",\"\",IF(B146=Finals!$X$6,Berechnung!$H$161,\"\"))","v":""},{"$f":"IF(B146=\"\",\"\",IF(B146=Finals!$X$5,Berechnung!$H$160,\"\"))","v":""},{"$f":"IF(E146=Finals!$X$7,Berechnung!$H$162,\"\")","v":""},null,null,null,null,null,null,null,null,null,null,null,null,null,null,null,null,null,null,null,null,null,null,null,null,null,null,null,{"$f":"IF(B146=\"\",\"\",IF(B146=Finals!$X$4,Berechnung!$H$159,\"\"))","v":""},{"$f":"IFERROR(IF(B146=\"\",\"\",LARGE(Y146:BF146:BF146,1)),0)","v":""},"","","","",{"$f":"IFERROR(LARGE($BI$116:$BJ$155,31),\"\")","v":""},"",null,"","","","",0,""]
[{"$f":"Spieler!A33","v":32},{"$f":"Spieler!C33","v":""},null,"","",{"$f":"IFERROR(IF(B147=\"\",\"\",VLOOKUP(B147,'2. Runde Gruppen'!$D$3:$H$20,5,FALSE)),\"\")","v":""},"","","",null,null,null,null,"","",null,{"$f":"IF(OR(F147<>\"\",G147<>\"\"),Berechnung!$H$164,D147)","v":""},"",null,8.9999999999999E-4,0,8.9999999999999E-4,"","","","",{"$f":"IF(B147=\"\",\"\",IF(B147=Finals!$X$7,Berechnung!$H$162,\"\"))","v":""},{"$f":"IF(B147=\"\",\"\",IF(B147=Finals!$X$6,Berechnung!$H$161,\"\"))","v":""},{"$f":"IF(B147=\"\",\"\",IF(B147=Finals!$X$5,Berechnung!$H$160,\"\"))","v":""},{"$f":"IF(E147=Finals!$X$7,Berechnung!$H$162,\"\")","v":""},null,null,null,null,null,null,null,null,null,null,null,null,null,null,null,null,null,null,null,null,null,null,null,null,null,null,null,{"$f":"IF(B147=\"\",\"\",IF(B147=Finals!$X$4,Berechnung!$H$159,\"\"))","v":""},{"$f":"IFERROR(IF(B147=\"\",\"\",LARGE(Y147:BF147:BF147,1)),0)","v":""},"","","","",{"$f":"IFERROR(LARGE($BI$116:$BJ$155,32),\"\")","v":""},{"$f":"IF(BJ147=\"\",\"\",VLOOKUP(BL147,$BI$116:$BJ$155,2,FALSE))","v":""},null,"","","","",0,""]
[{"$f":"Spieler!A34","v":33},{"$f":"Spieler!C34","v":""},null,"","",{"$f":"IFERROR(IF(B148=\"\",\"\",VLOOKUP(B148,'2. Runde Gruppen'!$D$3:$H$20,5,FALSE)),\"\")","v":""},"","","",null,null,null,null,"","",null,{"$f":"IF(OR(F148<>\"\",G148<>\"\"),Berechnung!$H$164,D148)","v":""},"",null,7.9999999999998996E-4,0,7.9999999999998996E-4,"","","","",{"$f":"IF(B148=\"\",\"\",IF(B148=Finals!$X$7,Berechnung!$H$162,\"\"))","v":""},{"$f":"IF(B148=\"\",\"\",IF(B148=Finals!$X$6,Berechnung!$H$161,\"\"))","v":""},{"$f":"IF(B148=\"\",\"\",IF(B148=Finals!$X$5,Berechnung!$H$160,\"\"))","v":""},{"$f":"IF(E148=Finals!$X$7,Berechnung!$H$162,\"\")","v":""},null,null,null,null,null,null,null,null,null,null,null,null,null,null,null,null,null,null,null,null,null,null,null,null,null,null,null,{"$f":"IF(B148=\"\",\"\",IF(B148=Finals!$X$4,Berechnung!$H$159,\"\"))","v":""},{"$f":"IFERROR(IF(B148=\"\",\"\",LARGE(Y148:BF148:BF148,1)),0)","v":""},"","","","",{"$f":"IFERROR(LARGE($BI$116:$BJ$155,33),\"\")","v":""},{"$f":"IF(BJ148=\"\",\"\",VLOOKUP(BL148,$BI$116:$BJ$155,2,FALSE))","v":""},null,"","","","",0,""]
[{"$f":"Spieler!A35","v":34},{"$f":"Spieler!C35","v":""},null,"","",{"$f":"IFERROR(IF(B149=\"\",\"\",VLOOKUP(B149,'2. Runde Gruppen'!$D$3:$H$20,5,FALSE)),\"\")","v":""},"","","",null,null,null,null,"","",null,{"$f":"IF(OR(F149<>\"\",G149<>\"\"),Berechnung!$H$164,D149)","v":""},"",null,6.9999999999999002E-4,0,6.9999999999999002E-4,"","","","",{"$f":"IF(B149=\"\",\"\",IF(B149=Finals!$X$7,Berechnung!$H$162,\"\"))","v":""},{"$f":"IF(B149=\"\",\"\",IF(B149=Finals!$X$6,Berechnung!$H$161,\"\"))","v":""},{"$f":"IF(B149=\"\",\"\",IF(B149=Finals!$X$5,Berechnung!$H$160,\"\"))","v":""},{"$f":"IF(E149=Finals!$X$7,Berechnung!$H$162,\"\")","v":""},null,null,null,null,null,null,null,null,null,null,null,null,null,null,null,null,null,null,null,null,null,null,null,null,null,null,null,{"$f":"IF(B149=\"\",\"\",IF(B149=Finals!$X$4,Berechnung!$H$159,\"\"))","v":""},{"$f":"IFERROR(IF(B149=\"\",\"\",LARGE(Y149:BF149:BF149,1)),0)","v":""},"","","","",{"$f":"IFERROR(LARGE($BI$116:$BJ$155,34),\"\")","v":""},"",null,"","","","",0,""]
[{"$f":"Spieler!A36","v":35},{"$f":"Spieler!C36","v":""},null,"","",{"$f":"IFERROR(IF(B150=\"\",\"\",VLOOKUP(B150,'2. Runde Gruppen'!$D$3:$H$20,5,FALSE)),\"\")","v":""},"","","",null,null,null,null,"","",null,{"$f":"IF(OR(F150<>\"\",G150<>\"\"),Berechnung!$H$164,D150)","v":""},"",null,5.9999999999998997E-4,0,5.9999999999998997E-4,"","","","",{"$f":"IF(B150=\"\",\"\",IF(B150=Finals!$X$7,Berechnung!$H$162,\"\"))","v":""},{"$f":"IF(B150=\"\",\"\",IF(B150=Finals!$X$6,Berechnung!$H$161,\"\"))","v":""},{"$f":"IF(B150=\"\",\"\",IF(B150=Finals!$X$5,Berechnung!$H$160,\"\"))","v":""},{"$f":"IF(E150=Finals!$X$7,Berechnung!$H$162,\"\")","v":""},null,null,null,null,null,null,null,null,null,null,null,null,null,null,null,null,null,null,null,null,null,null,null,null,null,null,null,{"$f":"IF(B150=\"\",\"\",IF(B150=Finals!$X$4,Berechnung!$H$159,\"\"))","v":""},{"$f":"IFERROR(IF(B150=\"\",\"\",LARGE(Y150:BF150:BF150,1)),0)","v":""},"","","","",{"$f":"IFERROR(LARGE($BI$116:$BJ$155,35),\"\")","v":""},"",null,"","","","",0,""]
[{"$f":"Spieler!A37","v":36},{"$f":"Spieler!C37","v":""},null,"","",{"$f":"IFERROR(IF(B151=\"\",\"\",VLOOKUP(B151,'2. Runde Gruppen'!$D$3:$H$20,5,FALSE)),\"\")","v":""},"","","",null,null,null,null,"","",null,{"$f":"IF(OR(F151<>\"\",G151<>\"\"),Berechnung!$H$164,D151)","v":""},"",null,4.9999999999999004E-4,0,4.9999999999999004E-4,"","","","",{"$f":"IF(B151=\"\",\"\",IF(B151=Finals!$X$7,Berechnung!$H$162,\"\"))","v":""},{"$f":"IF(B151=\"\",\"\",IF(B151=Finals!$X$6,Berechnung!$H$161,\"\"))","v":""},{"$f":"IF(B151=\"\",\"\",IF(B151=Finals!$X$5,Berechnung!$H$160,\"\"))","v":""},{"$f":"IF(E151=Finals!$X$7,Berechnung!$H$162,\"\")","v":""},null,null,null,null,null,null,null,null,null,null,null,null,null,null,null,null,null,null,null,null,null,null,null,null,null,null,null,{"$f":"IF(B151=\"\",\"\",IF(B151=Finals!$X$4,Berechnung!$H$159,\"\"))","v":""},{"$f":"IFERROR(IF(B151=\"\",\"\",LARGE(Y151:BF151:BF151,1)),0)","v":""},"","","","",{"$f":"IFERROR(LARGE($BI$116:$BJ$155,36),\"\")","v":""},"",null,"","","","",0,""]
[{"$f":"Spieler!A38","v":37},{"$f":"Spieler!C38","v":""},null,"","",{"$f":"IFERROR(IF(B152=\"\",\"\",VLOOKUP(B152,'2. Runde Gruppen'!$D$3:$H$20,5,FALSE)),\"\")","v":""},"","","",null,null,null,null,"","",null,{"$f":"IF(OR(F152<>\"\",G152<>\"\"),Berechnung!$H$164,D152)","v":""},"",null,3.9999999999998999E-4,0,3.9999999999998999E-4,"","","","",{"$f":"IF(B152=\"\",\"\",IF(B152=Finals!$X$7,Berechnung!$H$162,\"\"))","v":""},{"$f":"IF(B152=\"\",\"\",IF(B152=Finals!$X$6,Berechnung!$H$161,\"\"))","v":""},{"$f":"IF(B152=\"\",\"\",IF(B152=Finals!$X$5,Berechnung!$H$160,\"\"))","v":""},{"$f":"IF(E152=Finals!$X$7,Berechnung!$H$162,\"\")","v":""},null,null,null,null,null,null,null,null,null,null,null,null,null,null,null,null,null,null,null,null,null,null,null,null,null,null,null,{"$f":"IF(B152=\"\",\"\",IF(B152=Finals!$X$4,Berechnung!$H$159,\"\"))","v":""},{"$f":"IFERROR(IF(B152=\"\",\"\",LARGE(Y152:BF152:BF152,1)),0)","v":""},"","","","",{"$f":"IFERROR(LARGE($BI$116:$BJ$155,37),\"\")","v":""},"",null,"","","","",0,""]
[{"$f":"Spieler!A39","v":38},{"$f":"Spieler!C39","v":""},null,"","",{"$f":"IFERROR(IF(B153=\"\",\"\",VLOOKUP(B153,'2. Runde Gruppen'!$D$3:$H$20,5,FALSE)),\"\")","v":""},"","","",null,null,null,null,"","",null,{"$f":"IF(OR(F153<>\"\",G153<>\"\"),Berechnung!$H$164,D153)","v":""},"",null,2.9999999999999E-4,0,2.9999999999999E-4,"","","","",{"$f":"IF(B153=\"\",\"\",IF(B153=Finals!$X$7,Berechnung!$H$162,\"\"))","v":""},{"$f":"IF(B153=\"\",\"\",IF(B153=Finals!$X$6,Berechnung!$H$161,\"\"))","v":""},{"$f":"IF(B153=\"\",\"\",IF(B153=Finals!$X$5,Berechnung!$H$160,\"\"))","v":""},{"$f":"IF(E153=Finals!$X$7,Berechnung!$H$162,\"\")","v":""},null,null,null,null,null,null,null,null,null,null,null,null,null,null,null,null,null,null,null,null,null,null,null,null,null,null,null,{"$f":"IF(B153=\"\",\"\",IF(B153=Finals!$X$4,Berechnung!$H$159,\"\"))","v":""},{"$f":"IFERROR(IF(B153=\"\",\"\",LARGE(Y153:BF153:BF153,1)),0)","v":""},"","","","",{"$f":"IFERROR(LARGE($BI$116:$BJ$155,38),\"\")","v":""},"",null,"","","","",0,""]
[{"$f":"Spieler!A40","v":39},{"$f":"Spieler!C40","v":""},null,"","",{"$f":"IFERROR(IF(B154=\"\",\"\",VLOOKUP(B154,'2. Runde Gruppen'!$D$3:$H$20,5,FALSE)),\"\")","v":""},"","","",null,null,null,null,"","",null,{"$f":"IF(OR(F154<>\"\",G154<>\"\"),Berechnung!$H$164,D154)","v":""},"",null,1.9999999999999001E-4,0,1.9999999999999001E-4,"","","","",{"$f":"IF(B154=\"\",\"\",IF(B154=Finals!$X$7,Berechnung!$H$162,\"\"))","v":""},{"$f":"IF(B154=\"\",\"\",IF(B154=Finals!$X$6,Berechnung!$H$161,\"\"))","v":""},{"$f":"IF(B154=\"\",\"\",IF(B154=Finals!$X$5,Berechnung!$H$160,\"\"))","v":""},{"$f":"IF(E154=Finals!$X$7,Berechnung!$H$162,\"\")","v":""},null,null,null,null,null,null,null,null,null,null,null,null,null,null,null,null,null,null,null,null,null,null,null,null,null,null,null,{"$f":"IF(B154=\"\",\"\",IF(B154=Finals!$X$4,Berechnung!$H$159,\"\"))","v":""},{"$f":"IFERROR(IF(B154=\"\",\"\",LARGE(Y154:BF154:BF154,1)),0)","v":""},"","","","",{"$f":"IFERROR(LARGE($BI$116:$BJ$155,39),\"\")","v":""},"",null,"","","","",0,""]
[{"$f":"Spieler!A41","v":40},{"$f":"Spieler!C41","v":""},null,"","",{"$f":"IFERROR(IF(B155=\"\",\"\",VLOOKUP(B155,'2. Runde Gruppen'!$D$3:$H$20,5,FALSE)),\"\")","v":""},"","","",null,null,null,null,"","",null,{"$f":"IF(OR(F155<>\"\",G155<>\"\"),Berechnung!$H$164,D155)","v":""},"",null,9.9999999999990301E-5,0,9.9999999999990301E-5,"","","","",{"$f":"IF(B155=\"\",\"\",IF(B155=Finals!$X$7,Berechnung!$H$162,\"\"))","v":""},{"$f":"IF(B155=\"\",\"\",IF(B155=Finals!$X$6,Berechnung!$H$161,\"\"))","v":""},{"$f":"IF(B155=\"\",\"\",IF(B155=Finals!$X$5,Berechnung!$H$160,\"\"))","v":""},{"$f":"IF(E155=Finals!$X$7,Berechnung!$H$162,\"\")","v":""},null,null,null,null,null,null,null,null,null,null,null,null,null,null,null,null,null,null,null,null,null,null,null,null,null,null,null,{"$f":"IF(B155=\"\",\"\",IF(B155=Finals!$X$4,Berechnung!$H$159,\"\"))","v":""},{"$f":"IFERROR(IF(B155=\"\",\"\",LARGE(Y155:BF155:BF155,1)),0)","v":""},"","","","",{"$f":"IFERROR(LARGE($BI$116:$BJ$155,40),\"\")","v":""},"",null,"","","","",0,""]
[]
[]
[null,"Platzierung",null,"12-15 TN","16-23 TN","24-40 TN"]
[null,"1. Platz",null,{"$f":"Spieler!S18","v":150},{"$f":"Spieler!T18","v":250},{"$f":"Spieler!AA18","v":350},null,{"$f":"IF($BH$1<16,D159,IF(AND($BH$1>15,$BH$1<24),E159,IF($BH$1>23,F159)))","v":350}]
[null,"2. Platz",null,{"$f":"Spieler!S19","v":120},{"$f":"Spieler!T19","v":200},{"$f":"Spieler!AA19","v":300},null,{"$f":"IF($BH$1<16,D160,IF(AND($BH$1>15,$BH$1<24),E160,IF($BH$1>23,F160)))","v":300}]
[null,"3. Platz",null,{"$f":"Spieler!S20","v":90},{"$f":"Spieler!T20","v":140},{"$f":"Spieler!AA20","v":230},null,230]
[null,"4. Platz",null,{"$f":"Spieler!S21","v":90},{"$f":"Spieler!T21","v":140},{"$f":"Spieler!AA21","v":230},null,{"$f":"IF($BH$1<16,D162,IF(AND($BH$1>15,$BH$1<24),E162,IF($BH$1>23,F162)))","v":230}]
[null,"Viertelfinale",null,{"$f":"Spieler!S22","v":50},{"$f":"Spieler!T22","v":100},{"$f":"Spieler!AA22","v":150},null,150]
[null,"2. Runde (Gr. o. AF)",null,{"$f":"Spieler!S23","v":"-"},{"$f":"Spieler!T23","v":60},{"$f":"Spieler!AA23","v":100},null,100]
[null,"Teilnahme",null,{"$f":"Spieler!S24","v":20},{"$f":"Spieler!T24","v":30},{"$f":"Spieler!AA24","v":50},null,50]
[]
[]
[null,null,null,null,"R1",null,"R2",null,"AF",null,null,null,null,"VF",null,null,"HF",null,"F",null,"Gesamt"]
[null,null,null,null,"F+","F-","F+","F-","F+","F-","F+","F-","F+","F+","F-","F-","F+","F-","F+","F-","+","-",null,"%"]
[null,null,{"$f":"A116","v":1},{"$f":"B116","v":"Behling Oliver"},{"$f":"VLOOKUP($D170,$D$2:$J$83,5,FALSE)","v":2},{"$f":"VLOOKUP($D170,$D$2:$J$83,6,FALSE)","v":2},{"$f":"IFERROR(VLOOKUP($D170,'2. Runde Gruppen'!$D$3:$I$20,4,FALSE),0)","v":0},{"$f":"IFERROR(VLOOKUP($D170,'2. Runde Gruppen'!$D$3:$I$20,5,FALSE),0)","v":0},{"$f":"IFERROR(VLOOKUP($D170,Finals!$B$4:$I$26,2,FALSE),0)","v":0},{"$f":"IFERROR(VLOOKUP($D170,Finals!$B$4:$I$26,8,FALSE),0)","v":2},null,null,null,{"$f":"IFERROR(VLOOKUP($D170,Finals!$J$6:$P$24,2,FALSE),0)","v":0},{"$f":"IFERROR(VLOOKUP($D170,Finals!$J$6:$P$24,7,FALSE),0)","v":0},null,{"$f":"IFERROR(VLOOKUP($D170,Finals!$Q$10:$W$20,2,FALSE),0)","v":0},{"$f":"IFERROR(VLOOKUP($D170,Finals!$Q$10:$W$20,7,FALSE),0)","v":0},{"$f":"IFERROR(VLOOKUP($D170,Finals!$X$14:$AD$15,2,FALSE),0)","v":0},{"$f":"IFERROR(VLOOKUP($D170,Finals!$X$14:$AD$15,7,FALSE),0)","v":0},{"$f":"E170+G170+I170+N170+Q170+S170","v":2},{"$f":"F170+H170+J170+O170+R170+T170","v":4},{"$f":"U170+V170","v":6},{"$f":"IFERROR(U170/W170,\"\")","v":0.33333333333333331}]
[null,null,{"$f":"A117","v":2},"Brachmanski Dave",{"$f":"VLOOKUP($D171,$D$2:$J$83,5,FALSE)","v":1},4,{"$f":"IFERROR(VLOOKUP($D171,'2. Runde Gruppen'!$D$3:$I$20,4,FALSE),0)","v":0},{"$f":"IFERROR(VLOOKUP($D171,'2. Runde Gruppen'!$D$3:$I$20,5,FALSE),0)","v":0},{"$f":"IFERROR(VLOOKUP($D171,Finals!$B$4:$I$26,2,FALSE),0)","v":0},{"$f":"IFERROR(VLOOKUP($D171,Finals!$B$4:$I$26,8,FALSE),0)","v":0},null,null,null,{"$f":"IFERROR(VLOOKUP($D171,Finals!$J$6:$P$24,2,FALSE),0)","v":0},{"$f":"IFERROR(VLOOKUP($D171,Finals!$J$6:$P$24,7,FALSE),0)","v":0},null,{"$f":"IFERROR(VLOOKUP($D171,Finals!$Q$10:$W$20,2,FALSE),0)","v":0},{"$f":"IFERROR(VLOOKUP($D171,Finals!$Q$10:$W$20,7,FALSE),0)","v":0},{"$f":"IFERROR(VLOOKUP($D171,Finals!$X$14:$AD$15,2,FALSE),0)","v":0},{"$f":"IFERROR(VLOOKUP($D171,Finals!$X$14:$AD$15,7,FALSE),0)","v":0},{"$f":"E171+G171+I171+N171+Q171+S171","v":1},{"$f":"F171+H171+J171+O171+R171+T171","v":4},{"$f":"U171+V171","v":5},{"$f":"IFERROR(U171/W171,\"\")","v":0.2}]
[null,null,{"$f":"A118","v":3},"Brömel Frank",0,4,{"$f":"IFERROR(VLOOKUP($D172,'2. Runde Gruppen'!$D$3:$I$20,4,FALSE),0)","v":0},{"$f":"IFERROR(VLOOKUP($D172,'2. Runde Gruppen'!$D$3:$I$20,5,FALSE),0)","v":0},{"$f":"IFERROR(VLOOKUP($D172,Finals!$B$4:$I$26,2,FALSE),0)","v":0},{"$f":"IFERROR(VLOOKUP($D172,Finals!$B$4:$I$26,8,FALSE),0)","v":0},null,null,null,{"$f":"IFERROR(VLOOKUP($D172,Finals!$J$6:$P$24,2,FALSE),0)","v":0},{"$f":"IFERROR(VLOOKUP($D172,Finals!$J$6:$P$24,7,FALSE),0)","v":0},null,{"$f":"IFERROR(VLOOKUP($D172,Finals!$Q$10:$W$20,2,FALSE),0)","v":0},{"$f":"IFERROR(VLOOKUP($D172,Finals!$Q$10:$W$20,7,FALSE),0)","v":0},{"$f":"IFERROR(VLOOKUP($D172,Finals!$X$14:$AD$15,2,FALSE),0)","v":0},{"$f":"IFERROR(VLOOKUP($D172,Finals!$X$14:$AD$15,7,FALSE),0)","v":0},0,4,4,0]
[null,null,{"$f":"A119","v":4},"Delling Tino",4,0,{"$f":"IFERROR(VLOOKUP($D173,'2. Runde Gruppen'!$D$3:$I$20,4,FALSE),0)","v":0},{"$f":"IFERROR(VLOOKUP($D173,'2. Runde Gruppen'!$D$3:$I$20,5,FALSE),0)","v":0},{"$f":"IFERROR(VLOOKUP($D173,Finals!$B$4:$I$26,2,FALSE),0)","v":2},{"$f":"IFERROR(VLOOKUP($D173,Finals!$B$4:$I$26,8,FALSE),0)","v":0},null,null,null,{"$f":"IFERROR(VLOOKUP($D173,Finals!$J$6:$P$24,2,FALSE),0)","v":1},{"$f":"IFERROR(VLOOKUP($D173,Finals!$J$6:$P$24,7,FALSE),0)","v":2},null,{"$f":"IFERROR(VLOOKUP($D173,Finals!$Q$10:$W$20,2,FALSE),0)","v":0},{"$f":"IFERROR(VLOOKUP($D173,Finals!$Q$10:$W$20,7,FALSE),0)","v":0},{"$f":"IFERROR(VLOOKUP($D173,Finals!$X$14:$AD$15,2,FALSE),0)","v":0},{"$f":"IFERROR(VLOOKUP($D173,Finals!$X$14:$AD$15,7,FALSE),0)","v":0},7,2,9,0.77777777777777779]
[null,null,{"$f":"A120","v":5},"Drahn Robert",2,2,{"$f":"IFERROR(VLOOKUP($D174,'2. Runde Gruppen'!$D$3:$I$20,4,FALSE),0)","v":0},{"$f":"IFERROR(VLOOKUP($D174,'2. Runde Gruppen'!$D$3:$I$20,5,FALSE),0)","v":0},{"$f":"IFERROR(VLOOKUP($D174,Finals!$B$4:$I$26,2,FALSE),0)","v":0},{"$f":"IFERROR(VLOOKUP($D174,Finals!$B$4:$I$26,8,FALSE),0)","v":2},null,null,null,{"$f":"IFERROR(VLOOKUP($D174,Finals!$J$6:$P$24,2,FALSE),0)","v":0},{"$f":"IFERROR(VLOOKUP($D174,Finals!$J$6:$P$24,7,FALSE),0)","v":0},null,{"$f":"IFERROR(VLOOKUP($D174,Finals!$Q$10:$W$20,2,FALSE),0)","v":0},{"$f":"IFERROR(VLOOKUP($D174,Finals!$Q$10:$W$20,7,FALSE),0)","v":0},{"$f":"IFERROR(VLOOKUP($D174,Finals!$X$14:$AD$15,2,FALSE),0)","v":0},{"$f":"IFERROR(VLOOKUP($D174,Finals!$X$14:$AD$15,7,FALSE),0)","v":0},2,4,6,0.33333333333333331]
[null,null,{"$f":"A121","v":6},"Elham Faiz",{"$f":"VLOOKUP($D175,$D$2:$J$83,5,FALSE)","v":1},{"$f":"VLOOKUP($D175,$D$2:$J$83,6,FALSE)","v":4},{"$f":"IFERROR(VLOOKUP($D175,'2. Runde Gruppen'!$D$3:$I$20,4,FALSE),0)","v":0},{"$f":"IFERROR(VLOOKUP($D175,'2. Runde Gruppen'!$D$3:$I$20,5,FALSE),0)","v":0},{"$f":"IFERROR(VLOOKUP($D175,Finals!$B$4:$I$26,2,FALSE),0)","v":0},{"$f":"IFERROR(VLOOKUP($D175,Finals!$B$4:$I$26,8,FALSE),0)","v":0},null,null,null,{"$f":"IFERROR(VLOOKUP($D175,Finals!$J$6:$P$24,2,FALSE),0)","v":0},{"$f":"IFERROR(VLOOKUP($D175,Finals!$J$6:$P$24,7,FALSE),0)","v":0},null,{"$f":"IFERROR(VLOOKUP($D175,Finals!$Q$10:$W$20,2,FALSE),0)","v":0},{"$f":"IFERROR(VLOOKUP($D175,Finals!$Q$10:$W$20,7,FALSE),0)","v":0},{"$f":"IFERROR(VLOOKUP($D175,Finals!$X$14:$AD$15,2,FALSE),0)","v":0},{"$f":"IFERROR(VLOOKUP($D175,Finals!$X$14:$AD$15,7,FALSE),0)","v":0},1,{"$f":"F175+H175+J175+O175+R175+T175","v":4},5,{"$f":"IFERROR(U175/W175,\"\")","v":0.2}]
[null,null,{"$f":"A122","v":7},"Fandrei Andreas",{"$f":"VLOOKUP($D176,$D$2:$J$83,5,FALSE)","v":2},{"$f":"VLOOKUP($D176,$D$2:$J$83,6,FALSE)","v":2},{"$f":"IFERROR(VLOOKUP($D176,'2. Runde Gruppen'!$D$3:$I$20,4,FALSE),0)","v":0},{"$f":"IFERROR(VLOOKUP($D176,'2. Runde Gruppen'!$D$3:$I$20,5,FALSE),0)","v":0},{"$f":"IFERROR(VLOOKUP($D176,Finals!$B$4:$I$26,2,FALSE),0)","v":0},{"$f":"IFERROR(VLOOKUP($D176,Finals!$B$4:$I$26,8,FALSE),0)","v":2},null,null,null,{"$f":"IFERROR(VLOOKUP($D176,Finals!$J$6:$P$24,2,FALSE),0)","v":0},{"$f":"IFERROR(VLOOKUP($D176,Finals!$J$6:$P$24,7,FALSE),0)","v":0},null,{"$f":"IFERROR(VLOOKUP($D176,Finals!$Q$10:$W$20,2,FALSE),0)","v":0},{"$f":"IFERROR(VLOOKUP($D176,Finals!$Q$10:$W$20,7,FALSE),0)","v":0},{"$f":"IFERROR(VLOOKUP($D176,Finals!$X$14:$AD$15,2,FALSE),0)","v":0},{"$f":"IFERROR(VLOOKUP($D176,Finals!$X$14:$AD$15,7,FALSE),0)","v":0},2,4,6,0.33333333333333331]
[null,null,{"$f":"A123","v":8},"Fandrei Joel",4,1,{"$f":"IFERROR(VLOOKUP($D177,'2. Runde Gruppen'!$D$3:$I$20,4,FALSE),0)","v":0},{"$f":"IFERROR(VLOOKUP($D177,'2. Runde Gruppen'!$D$3:$I$20,5,FALSE),0)","v":0},{"$f":"IFERROR(VLOOKUP($D177,Finals!$B$4:$I$26,2,FALSE),0)","v":2},{"$f":"IFERROR(VLOOKUP($D177,Finals!$B$4:$I$26,8,FALSE),0)","v":1},null,null,null,{"$f":"IFERROR(VLOOKUP($D177,Finals!$J$6:$P$24,2,FALSE),0)","v":2},{"$f":"IFERROR(VLOOKUP($D177,Finals!$J$6:$P$24,7,FALSE),0)","v":1},null,{"$f":"IFERROR(VLOOKUP($D177,Finals!$Q$10:$W$20,2,FALSE),0)","v":1},{"$f":"IFERROR(VLOOKUP($D177,Finals!$Q$10:$W$20,7,FALSE),0)","v":2},{"$f":"IFERROR(VLOOKUP($D177,Finals!$X$14:$AD$15,2,FALSE),0)","v":0},{"$f":"IFERROR(VLOOKUP($D177,Finals!$X$14:$AD$15,7,FALSE),0)","v":0},9,5,14,0.6428571428571429]
[null,null,{"$f":"A124","v":9},"Gärtner David",4,2,{"$f":"IFERROR(VLOOKUP($D178,'2. Runde Gruppen'!$D$3:$I$20,4,FALSE),0)","v":0},{"$f":"IFERROR(VLOOKUP($D178,'2. Runde Gruppen'!$D$3:$I$20,5,FALSE),0)","v":0},{"$f":"IFERROR(VLOOKUP($D178,Finals!$B$4:$I$26,2,FALSE),0)","v":2},{"$f":"IFERROR(VLOOKUP($D178,Finals!$B$4:$I$26,8,FALSE),0)","v":0},null,null,null,{"$f":"IFERROR(VLOOKUP($D178,Finals!$J$6:$P$24,2,FALSE),0)","v":0},{"$f":"IFERROR(VLOOKUP($D178,Finals!$J$6:$P$24,7,FALSE),0)","v":2},null,{"$f":"IFERROR(VLOOKUP($D178,Finals!$Q$10:$W$20,2,FALSE),0)","v":0},{"$f":"IFERROR(VLOOKUP($D178,Finals!$Q$10:$W$20,7,FALSE),0)","v":0},{"$f":"IFERROR(VLOOKUP($D178,Finals!$X$14:$AD$15,2,FALSE),0)","v":0},{"$f":"IFERROR(VLOOKUP($D178,Finals!$X$14:$AD$15,7,FALSE),0)","v":0},6,4,{"$f":"U178+V178","v":10},0.6]
[null,null,{"$f":"A125","v":10},"Hartung Andreas",1,4,{"$f":"IFERROR(VLOOKUP($D179,'2. Runde Gruppen'!$D$3:$I$20,4,FALSE),0)","v":0},{"$f":"IFERROR(VLOOKUP($D179,'2. Runde Gruppen'!$D$3:$I$20,5,FALSE),0)","v":0},{"$f":"IFERROR(VLOOKUP($D179,Finals!$B$4:$I$26,2,FALSE),0)","v":0},{"$f":"IFERROR(VLOOKUP($D179,Finals!$B$4:$I$26,8,FALSE),0)","v":0},null,null,null,{"$f":"IFERROR(VLOOKUP($D179,Finals!$J$6:$P$24,2,FALSE),0)","v":0},{"$f":"IFERROR(VLOOKUP($D179,Finals!$J$6:$P$24,7,FALSE),0)","v":0},null,{"$f":"IFERROR(VLOOKUP($D179,Finals!$Q$10:$W$20,2,FALSE),0)","v":0},{"$f":"IFERROR(VLOOKUP($D179,Finals!$Q$10:$W$20,7,FALSE),0)","v":0},{"$f":"IFERROR(VLOOKUP($D179,Finals!$X$14:$AD$15,2,FALSE),0)","v":0},{"$f":"IFERROR(VLOOKUP($D179,Finals!$X$14:$AD$15,7,FALSE),0)","v":0},1,4,5,0.2]
[null,null,{"$f":"A126","v":11},"Hofmann Frank",2,2,{"$f":"IFERROR(VLOOKUP($D180,'2. Runde Gruppen'!$D$3:$I$20,4,FALSE),0)","v":0},{"$f":"IFERROR(VLOOKUP($D180,'2. Runde Gruppen'!$D$3:$I$20,5,FALSE),0)","v":0},{"$f":"IFERROR(VLOOKUP($D180,Finals!$B$4:$I$26,2,FALSE),0)","v":0},{"$f":"IFERROR(VLOOKUP($D180,Finals!$B$4:$I$26,8,FALSE),0)","v":2},null,null,null,{"$f":"IFERROR(VLOOKUP($D180,Finals!$J$6:$P$24,2,FALSE),0)","v":0},{"$f":"IFERROR(VLOOKUP($D180,Finals!$J$6:$P$24,7,FALSE),0)","v":0},null,{"$f":"IFERROR(VLOOKUP($D180,Finals!$Q$10:$W$20,2,FALSE),0)","v":0},{"$f":"IFERROR(VLOOKUP($D180,Finals!$Q$10:$W$20,7,FALSE),0)","v":0},{"$f":"IFERROR(VLOOKUP($D180,Finals!$X$14:$AD$15,2,FALSE),0)","v":0},{"$f":"IFERROR(VLOOKUP($D180,Finals!$X$14:$AD$15,7,FALSE),0)","v":0},2,4,6,0.33333333333333331]
[null,null,{"$f":"A127","v":12},"Isermann Rene",0,4,{"$f":"IFERROR(VLOOKUP($D181,'2. Runde Gruppen'!$D$3:$I$20,4,FALSE),0)","v":0},{"$f":"IFERROR(VLOOKUP($D181,'2. Runde Gruppen'!$D$3:$I$20,5,FALSE),0)","v":0},{"$f":"IFERROR(VLOOKUP($D181,Finals!$B$4:$I$26,2,FALSE),0)","v":0},{"$f":"IFERROR(VLOOKUP($D181,Finals!$B$4:$I$26,8,FALSE),0)","v":0},null,null,null,{"$f":"IFERROR(VLOOKUP($D181,Finals!$J$6:$P$24,2,FALSE),0)","v":0},{"$f":"IFERROR(VLOOKUP($D181,Finals!$J$6:$P$24,7,FALSE),0)","v":0},null,{"$f":"IFERROR(VLOOKUP($D181,Finals!$Q$10:$W$20,2,FALSE),0)","v":0},{"$f":"IFERROR(VLOOKUP($D181,Finals!$Q$10:$W$20,7,FALSE),0)","v":0},{"$f":"IFERROR(VLOOKUP($D181,Finals!$X$14:$AD$15,2,FALSE),0)","v":0},{"$f":"IFERROR(VLOOKUP($D181,Finals!$X$14:$AD$15,7,FALSE),0)","v":0},0,4,4,0]
[null,null,{"$f":"A128","v":13},"Jeroch Paul",4,1,{"$f":"IFERROR(VLOOKUP($D182,'2. Runde Gruppen'!$D$3:$I$20,4,FALSE),0)","v":0},{"$f":"IFERROR(VLOOKUP($D182,'2. Runde Gruppen'!$D$3:$I$20,5,FALSE),0)","v":0},{"$f":"IFERROR(VLOOKUP($D182,Finals!$B$4:$I$26,2,FALSE),0)","v":2},{"$f":"IFERROR(VLOOKUP($D182,Finals!$B$4:$I$26,8,FALSE),0)","v":0},null,null,null,{"$f":"IFERROR(VLOOKUP($D182,Finals!$J$6:$P$24,2,FALSE),0)","v":2},{"$f":"IFERROR(VLOOKUP($D182,Finals!$J$6:$P$24,7,FALSE),0)","v":1},null,{"$f":"IFERROR(VLOOKUP($D182,Finals!$Q$10:$W$20,2,FALSE),0)","v":2},{"$f":"IFERROR(VLOOKUP($D182,Finals!$Q$10:$W$20,7,FALSE),0)","v":1},{"$f":"IFERROR(VLOOKUP($D182,Finals!$X$14:$AD$15,2,FALSE),0)","v":0},{"$f":"IFERROR(VLOOKUP($D182,Finals!$X$14:$AD$15,7,FALSE),0)","v":2},10,5,15,0.66666666666666663]
[null,null,{"$f":"A129","v":14},"Löffel Ulrich",0,4,{"$f":"IFERROR(VLOOKUP($D183,'2. Runde Gruppen'!$D$3:$I$20,4,FALSE),0)","v":0},{"$f":"IFERROR(VLOOKUP($D183,'2. Runde Gruppen'!$D$3:$I$20,5,FALSE),0)","v":0},{"$f":"IFERROR(VLOOKUP($D183,Finals!$B$4:$I$26,2,FALSE),0)","v":0},{"$f":"IFERROR(VLOOKUP($D183,Finals!$B$4:$I$26,8,FALSE),0)","v":0},null,null,null,{"$f":"IFERROR(VLOOKUP($D183,Finals!$J$6:$P$24,2,FALSE),0)","v":0},{"$f":"IFERROR(VLOOKUP($D183,Finals!$J$6:$P$24,7,FALSE),0)","v":0},null,{"$f":"IFERROR(VLOOKUP($D183,Finals!$Q$10:$W$20,2,FALSE),0)","v":0},{"$f":"IFERROR(VLOOKUP($D183,Finals!$Q$10:$W$20,7,FALSE),0)","v":0},{"$f":"IFERROR(VLOOKUP($D183,Finals!$X$14:$AD$15,2,FALSE),0)","v":0},{"$f":"IFERROR(VLOOKUP($D183,Finals!$X$14:$AD$15,7,FALSE),0)","v":0},0,4,4,0]
[null,null,{"$f":"A130","v":15},"Müller Marcus",2,2,{"$f":"IFERROR(VLOOKUP($D184,'2. Runde Gruppen'!$D$3:$I$20,4,FALSE),0)","v":0},{"$f":"IFERROR(VLOOKUP($D184,'2. Runde Gruppen'!$D$3:$I$20,5,FALSE),0)","v":0},{"$f":"IFERROR(VLOOKUP($D184,Finals!$B$4:$I$26,2,FALSE),0)","v":2},{"$f":"IFERROR(VLOOKUP($D184,Finals!$B$4:$I$26,8,FALSE),0)","v":1},null,null,null,{"$f":"IFERROR(VLOOKUP($D184,Finals!$J$6:$P$24,2,FALSE),0)","v":2},{"$f":"IFERROR(VLOOKUP($D184,Finals!$J$6:$P$24,7,FALSE),0)","v":0},null,{"$f":"IFERROR(VLOOKUP($D184,Finals!$Q$10:$W$20,2,FALSE),0)","v":0},{"$f":"IFERROR(VLOOKUP($D184,Finals!$Q$10:$W$20,7,FALSE),0)","v":2},{"$f":"IFERROR(VLOOKUP($D184,Finals!$X$14:$AD$15,2,FALSE),0)","v":0},{"$f":"IFERROR(VLOOKUP($D184,Finals!$X$14:$AD$15,7,FALSE),0)","v":0},6,5,11,0.54545454545454541]
[null,null,{"$f":"A131","v":16},"Rejke Ronny",1,4,{"$f":"IFERROR(VLOOKUP($D185,'2. Runde Gruppen'!$D$3:$I$20,4,FALSE),0)","v":0},{"$f":"IFERROR(VLOOKUP($D185,'2. Runde Gruppen'!$D$3:$I$20,5,FALSE),0)","v":0},{"$f":"IFERROR(VLOOKUP($D185,Finals!$B$4:$I$26,2,FALSE),0)","v":0},{"$f":"IFERROR(VLOOKUP($D185,Finals!$B$4:$I$26,8,FALSE),0)","v":0},null,null,null,{"$f":"IFERROR(VLOOKUP($D185,Finals!$J$6:$P$24,2,FALSE),0)","v":0},{"$f":"IFERROR(VLOOKUP($D185,Finals!$J$6:$P$24,7,FALSE),0)","v":0},null,{"$f":"IFERROR(VLOOKUP($D185,Finals!$Q$10:$W$20,2,FALSE),0)","v":0},{"$f":"IFERROR(VLOOKUP($D185,Finals!$Q$10:$W$20,7,FALSE),0)","v":0},{"$f":"IFERROR(VLOOKUP($D185,Finals!$X$14:$AD$15,2,FALSE),0)","v":0},{"$f":"IFERROR(VLOOKUP($D185,Finals!$X$14:$AD$15,7,FALSE),0)","v":0},1,4,5,0.2]
[null,null,{"$f":"A132","v":17},"Stachly Marec",4,0,{"$f":"IFERROR(VLOOKUP($D186,'2. Runde Gruppen'!$D$3:$I$20,4,FALSE),0)","v":0},{"$f":"IFERROR(VLOOKUP($D186,'2. Runde Gruppen'!$D$3:$I$20,5,FALSE),0)","v":0},{"$f":"IFERROR(VLOOKUP($D186,Finals!$B$4:$I$26,2,FALSE),0)","v":2},{"$f":"IFERROR(VLOOKUP($D186,Finals!$B$4:$I$26,8,FALSE),0)","v":1},null,null,null,{"$f":"IFERROR(VLOOKUP($D186,Finals!$J$6:$P$24,2,FALSE),0)","v":1},{"$f":"IFERROR(VLOOKUP($D186,Finals!$J$6:$P$24,7,FALSE),0)","v":2},null,{"$f":"IFERROR(VLOOKUP($D186,Finals!$Q$10:$W$20,2,FALSE),0)","v":0},{"$f":"IFERROR(VLOOKUP($D186,Finals!$Q$10:$W$20,7,FALSE),0)","v":0},{"$f":"IFERROR(VLOOKUP($D186,Finals!$X$14:$AD$15,2,FALSE),0)","v":0},{"$f":"IFERROR(VLOOKUP($D186,Finals!$X$14:$AD$15,7,FALSE),0)","v":0},7,3,10,0.7]
[null,null,{"$f":"A133","v":18},"Straßburger Marko",4,2,{"$f":"IFERROR(VLOOKUP($D187,'2. Runde Gruppen'!$D$3:$I$20,4,FALSE),0)","v":0},{"$f":"IFERROR(VLOOKUP($D187,'2. Runde Gruppen'!$D$3:$I$20,5,FALSE),0)","v":0},{"$f":"IFERROR(VLOOKUP($D187,Finals!$B$4:$I$26,2,FALSE),0)","v":1},{"$f":"IFERROR(VLOOKUP($D187,Finals!$B$4:$I$26,8,FALSE),0)","v":2},null,null,null,{"$f":"IFERROR(VLOOKUP($D187,Finals!$J$6:$P$24,2,FALSE),0)","v":0},{"$f":"IFERROR(VLOOKUP($D187,Finals!$J$6:$P$24,7,FALSE),0)","v":0},null,{"$f":"IFERROR(VLOOKUP($D187,Finals!$Q$10:$W$20,2,FALSE),0)","v":0},{"$f":"IFERROR(VLOOKUP($D187,Finals!$Q$10:$W$20,7,FALSE),0)","v":0},{"$f":"IFERROR(VLOOKUP($D187,Finals!$X$14:$AD$15,2,FALSE),0)","v":0},{"$f":"IFERROR(VLOOKUP($D187,Finals!$X$14:$AD$15,7,FALSE),0)","v":0},5,{"$f":"F187+H187+J187+O187+R187+T187","v":4},9,0.55555555555555558]
[null,null,{"$f":"A134","v":19},"Suttner Magnus",3,2,{"$f":"IFERROR(VLOOKUP($D188,'2. Runde Gruppen'!$D$3:$I$20,4,FALSE),0)","v":0},{"$f":"IFERROR(VLOOKUP($D188,'2. Runde Gruppen'!$D$3:$I$20,5,FALSE),0)","v":0},{"$f":"IFERROR(VLOOKUP($D188,Finals!$B$4:$I$26,2,FALSE),0)","v":1},{"$f":"IFERROR(VLOOKUP($D188,Finals!$B$4:$I$26,8,FALSE),0)","v":2},null,null,null,{"$f":"IFERROR(VLOOKUP($D188,Finals!$J$6:$P$24,2,FALSE),0)","v":0},{"$f":"IFERROR(VLOOKUP($D188,Finals!$J$6:$P$24,7,FALSE),0)","v":0},null,{"$f":"IFERROR(VLOOKUP($D188,Finals!$Q$10:$W$20,2,FALSE),0)","v":0},{"$f":"IFERROR(VLOOKUP($D188,Finals!$Q$10:$W$20,7,FALSE),0)","v":0},{"$f":"IFERROR(VLOOKUP($D188,Finals!$X$14:$AD$15,2,FALSE),0)","v":0},{"$f":"IFERROR(VLOOKUP($D188,Finals!$X$14:$AD$15,7,FALSE),0)","v":0},4,4,8,0.5]
[null,null,{"$f":"A135","v":20},"Swennen Andy",0,4,{"$f":"IFERROR(VLOOKUP($D189,'2. Runde Gruppen'!$D$3:$I$20,4,FALSE),0)","v":0},{"$f":"IFERROR(VLOOKUP($D189,'2. Runde Gruppen'!$D$3:$I$20,5,FALSE),0)","v":0},{"$f":"IFERROR(VLOOKUP($D189,Finals!$B$4:$I$26,2,FALSE),0)","v":0},{"$f":"IFERROR(VLOOKUP($D189,Finals!$B$4:$I$26,8,FALSE),0)","v":0},null,null,null,{"$f":"IFERROR(VLOOKUP($D189,Finals!$J$6:$P$24,2,FALSE),0)","v":0},{"$f":"IFERROR(VLOOKUP($D189,Finals!$J$6:$P$24,7,FALSE),0)","v":0},null,{"$f":"IFERROR(VLOOKUP($D189,Finals!$Q$10:$W$20,2,FALSE),0)","v":0},{"$f":"IFERROR(VLOOKUP($D189,Finals!$Q$10:$W$20,7,FALSE),0)","v":0},{"$f":"IFERROR(VLOOKUP($D189,Finals!$X$14:$AD$15,2,FALSE),0)","v":0},{"$f":"IFERROR(VLOOKUP($D189,Finals!$X$14:$AD$15,7,FALSE),0)","v":0},0,4,4,0]
[null,null,{"$f":"A136","v":21},"Thomas Moritz",3,3,{"$f":"IFERROR(VLOOKUP($D190,'2. Runde Gruppen'!$D$3:$I$20,4,FALSE),0)","v":0},{"$f":"IFERROR(VLOOKUP($D190,'2. Runde Gruppen'!$D$3:$I$20,5,FALSE),0)","v":0},{"$f":"IFERROR(VLOOKUP($D190,Finals!$B$4:$I$26,2,FALSE),0)","v":2},{"$f":"IFERROR(VLOOKUP($D190,Finals!$B$4:$I$26,8,FALSE),0)","v":0},null,null,null,{"$f":"IFERROR(VLOOKUP($D190,Finals!$J$6:$P$24,2,FALSE),0)","v":0},{"$f":"IFERROR(VLOOKUP($D190,Finals!$J$6:$P$24,7,FALSE),0)","v":2},null,{"$f":"IFERROR(VLOOKUP($D190,Finals!$Q$10:$W$20,2,FALSE),0)","v":0},{"$f":"IFERROR(VLOOKUP($D190,Finals!$Q$10:$W$20,7,FALSE),0)","v":0},{"$f":"IFERROR(VLOOKUP($D190,Finals!$X$14:$AD$15,2,FALSE),0)","v":0},{"$f":"IFERROR(VLOOKUP($D190,Finals!$X$14:$AD$15,7,FALSE),0)","v":0},5,5,10,0.5]
[null,null,{"$f":"A137","v":22},"Valderrama Salvador",3,2,{"$f":"IFERROR(VLOOKUP($D191,'2. Runde Gruppen'!$D$3:$I$20,4,FALSE),0)","v":0},{"$f":"IFERROR(VLOOKUP($D191,'2. Runde Gruppen'!$D$3:$I$20,5,FALSE),0)","v":0},{"$f":"IFERROR(VLOOKUP($D191,Finals!$B$4:$I$26,2,FALSE),0)","v":1},{"$f":"IFERROR(VLOOKUP($D191,Finals!$B$4:$I$26,8,FALSE),0)","v":2},null,null,null,{"$f":"IFERROR(VLOOKUP($D191,Finals!$J$6:$P$24,2,FALSE),0)","v":0},{"$f":"IFERROR(VLOOKUP($D191,Finals!$J$6:$P$24,7,FALSE),0)","v":0},null,{"$f":"IFERROR(VLOOKUP($D191,Finals!$Q$10:$W$20,2,FALSE),0)","v":0},{"$f":"IFERROR(VLOOKUP($D191,Finals!$Q$10:$W$20,7,FALSE),0)","v":0},{"$f":"IFERROR(VLOOKUP($D191,Finals!$X$14:$AD$15,2,FALSE),0)","v":0},{"$f":"IFERROR(VLOOKUP($D191,Finals!$X$14:$AD$15,7,FALSE),0)","v":0},4,4,8,0.5]
[null,null,{"$f":"A138","v":23},"Weber Marco",4,0,{"$f":"IFERROR(VLOOKUP($D192,'2. Runde Gruppen'!$D$3:$I$20,4,FALSE),0)","v":0},{"$f":"IFERROR(VLOOKUP($D192,'2. Runde Gruppen'!$D$3:$I$20,5,FALSE),0)","v":0},{"$f":"IFERROR(VLOOKUP($D192,Finals!$B$4:$I$26,2,FALSE),0)","v":2},{"$f":"IFERROR(VLOOKUP($D192,Finals!$B$4:$I$26,8,FALSE),0)","v":0},null,null,null,{"$f":"IFERROR(VLOOKUP($D192,Finals!$J$6:$P$24,2,FALSE),0)","v":2},{"$f":"IFERROR(VLOOKUP($D192,Finals!$J$6:$P$24,7,FALSE),0)","v":0},null,{"$f":"IFERROR(VLOOKUP($D192,Finals!$Q$10:$W$20,2,FALSE),0)","v":2},{"$f":"IFERROR(VLOOKUP($D192,Finals!$Q$10:$W$20,7,FALSE),0)","v":0},{"$f":"IFERROR(VLOOKUP($D192,Finals!$X$14:$AD$15,2,FALSE),0)","v":2},{"$f":"IFERROR(VLOOKUP($D192,Finals!$X$14:$AD$15,7,FALSE),0)","v":0},12,0,12,1]
[null,null,{"$f":"A139","v":24},"Witzik Oliver",4,0,{"$f":"IFERROR(VLOOKUP($D193,'2. Runde Gruppen'!$D$3:$I$20,4,FALSE),0)","v":0},{"$f":"IFERROR(VLOOKUP($D193,'2. Runde Gruppen'!$D$3:$I$20,5,FALSE),0)","v":0},{"$f":"IFERROR(VLOOKUP($D193,Finals!$B$4:$I$26,2,FALSE),0)","v":0},{"$f":"IFERROR(VLOOKUP($D193,Finals!$B$4:$I$26,8,FALSE),0)","v":2},null,null,null,{"$f":"IFERROR(VLOOKUP($D193,Finals!$J$6:$P$24,2,FALSE),0)","v":0},{"$f":"IFERROR(VLOOKUP($D193,Finals!$J$6:$P$24,7,FALSE),0)","v":0},null,{"$f":"IFERROR(VLOOKUP($D193,Finals!$Q$10:$W$20,2,FALSE),0)","v":0},{"$f":"IFERROR(VLOOKUP($D193,Finals!$Q$10:$W$20,7,FALSE),0)","v":0},{"$f":"IFERROR(VLOOKUP($D193,Finals!$X$14:$AD$15,2,FALSE),0)","v":0},{"$f":"IFERROR(VLOOKUP($D193,Finals!$X$14:$AD$15,7,FALSE),0)","v":0},4,2,6,0.66666666666666663]
[null,null,{"$f":"A140","v":25},"",0,0,{"$f":"IFERROR(VLOOKUP($D194,'2. Runde Gruppen'!$D$3:$I$20,4,FALSE),0)","v":0},{"$f":"IFERROR(VLOOKUP($D194,'2. Runde Gruppen'!$D$3:$I$20,5,FALSE),0)","v":0},{"$f":"IFERROR(VLOOKUP($D194,Finals!$B$4:$I$26,2,FALSE),0)","v":0},{"$f":"IFERROR(VLOOKUP($D194,Finals!$B$4:$I$26,8,FALSE),0)","v":0},null,null,null,{"$f":"IFERROR(VLOOKUP($D194,Finals!$J$6:$P$24,2,FALSE),0)","v":0},{"$f":"IFERROR(VLOOKUP($D194,Finals!$J$6:$P$24,7,FALSE),0)","v":0},null,{"$f":"IFERROR(VLOOKUP($D194,Finals!$Q$10:$W$20,2,FALSE),0)","v":0},{"$f":"IFERROR(VLOOKUP($D194,Finals!$Q$10:$W$20,7,FALSE),0)","v":0},{"$f":"IFERROR(VLOOKUP($D194,Finals!$X$14:$AD$15,2,FALSE),0)","v":0},{"$f":"IFERROR(VLOOKUP($D194,Finals!$X$14:$AD$15,7,FALSE),0)","v":0},0,0,0,""]
[null,null,{"$f":"A141","v":26},"",0,0,{"$f":"IFERROR(VLOOKUP($D195,'2. Runde Gruppen'!$D$3:$I$20,4,FALSE),0)","v":0},{"$f":"IFERROR(VLOOKUP($D195,'2. Runde Gruppen'!$D$3:$I$20,5,FALSE),0)","v":0},{"$f":"IFERROR(VLOOKUP($D195,Finals!$B$4:$I$26,2,FALSE),0)","v":0},{"$f":"IFERROR(VLOOKUP($D195,Finals!$B$4:$I$26,8,FALSE),0)","v":0},null,null,null,{"$f":"IFERROR(VLOOKUP($D195,Finals!$J$6:$P$24,2,FALSE),0)","v":0},{"$f":"IFERROR(VLOOKUP($D195,Finals!$J$6:$P$24,7,FALSE),0)","v":0},null,{"$f":"IFERROR(VLOOKUP($D195,Finals!$Q$10:$W$20,2,FALSE),0)","v":0},{"$f":"IFERROR(VLOOKUP($D195,Finals!$Q$10:$W$20,7,FALSE),0)","v":0},{"$f":"IFERROR(VLOOKUP($D195,Finals!$X$14:$AD$15,2,FALSE),0)","v":0},{"$f":"IFERROR(VLOOKUP($D195,Finals!$X$14:$AD$15,7,FALSE),0)","v":0},0,0,0,""]
[null,null,{"$f":"A142","v":27},"",0,0,{"$f":"IFERROR(VLOOKUP($D196,'2. Runde Gruppen'!$D$3:$I$20,4,FALSE),0)","v":0},{"$f":"IFERROR(VLOOKUP($D196,'2. Runde Gruppen'!$D$3:$I$20,5,FALSE),0)","v":0},{"$f":"IFERROR(VLOOKUP($D196,Finals!$B$4:$I$26,2,FALSE),0)","v":0},{"$f":"IFERROR(VLOOKUP($D196,Finals!$B$4:$I$26,8,FALSE),0)","v":0},null,null,null,{"$f":"IFERROR(VLOOKUP($D196,Finals!$J$6:$P$24,2,FALSE),0)","v":0},{"$f":"IFERROR(VLOOKUP($D196,Finals!$J$6:$P$24,7,FALSE),0)","v":0},null,{"$f":"IFERROR(VLOOKUP($D196,Finals!$Q$10:$W$20,2,FALSE),0)","v":0},{"$f":"IFERROR(VLOOKUP($D196,Finals!$Q$10:$W$20,7,FALSE),0)","v":0},{"$f":"IFERROR(VLOOKUP($D196,Finals!$X$14:$AD$15,2,FALSE),0)","v":0},{"$f":"IFERROR(VLOOKUP($D196,Finals!$X$14:$AD$15,7,FALSE),0)","v":0},0,0,0,""]
[null,null,{"$f":"A143","v":28},"",0,0,{"$f":"IFERROR(VLOOKUP($D197,'2. Runde Gruppen'!$D$3:$I$20,4,FALSE),0)","v":0},{"$f":"IFERROR(VLOOKUP($D197,'2. Runde Gruppen'!$D$3:$I$20,5,FALSE),0)","v":0},{"$f":"IFERROR(VLOOKUP($D197,Finals!$B$4:$I$26,2,FALSE),0)","v":0},{"$f":"IFERROR(VLOOKUP($D197,Finals!$B$4:$I$26,8,FALSE),0)","v":0},null,null,null,{"$f":"IFERROR(VLOOKUP($D197,Finals!$J$6:$P$24,2,FALSE),0)","v":0},{"$f":"IFERROR(VLOOKUP($D197,Finals!$J$6:$P$24,7,FALSE),0)","v":0},null,{"$f":"IFERROR(VLOOKUP($D197,Finals!$Q$10:$W$20,2,FALSE),0)","v":0},{"$f":"IFERROR(VLOOKUP($D197,Finals!$Q$10:$W$20,7,FALSE),0)","v":0},{"$f":"IFERROR(VLOOKUP($D197,Finals!$X$14:$AD$15,2,FALSE),0)","v":0},{"$f":"IFERROR(VLOOKUP($D197,Finals!$X$14:$AD$15,7,FALSE),0)","v":0},0,0,0,""]
[null,null,{"$f":"A144","v":29},"",0,0,{"$f":"IFERROR(VLOOKUP($D198,'2. Runde Gruppen'!$D$3:$I$20,4,FALSE),0)","v":0},{"$f":"IFERROR(VLOOKUP($D198,'2. Runde Gruppen'!$D$3:$I$20,5,FALSE),0)","v":0},{"$f":"IFERROR(VLOOKUP($D198,Finals!$B$4:$I$26,2,FALSE),0)","v":0},{"$f":"IFERROR(VLOOKUP($D198,Finals!$B$4:$I$26,8,FALSE),0)","v":0},null,null,null,{"$f":"IFERROR(VLOOKUP($D198,Finals!$J$6:$P$24,2,FALSE),0)","v":0},{"$f":"IFERROR(VLOOKUP($D198,Finals!$J$6:$P$24,7,FALSE),0)","v":0},null,{"$f":"IFERROR(VLOOKUP($D198,Finals!$Q$10:$W$20,2,FALSE),0)","v":0},{"$f":"IFERROR(VLOOKUP($D198,Finals!$Q$10:$W$20,7,FALSE),0)","v":0},{"$f":"IFERROR(VLOOKUP($D198,Finals!$X$14:$AD$15,2,FALSE),0)","v":0},{"$f":"IFERROR(VLOOKUP($D198,Finals!$X$14:$AD$15,7,FALSE),0)","v":0},0,0,0,""]
[null,null,{"$f":"A145","v":30},"",0,0,{"$f":"IFERROR(VLOOKUP($D199,'2. Runde Gruppen'!$D$3:$I$20,4,FALSE),0)","v":0},{"$f":"IFERROR(VLOOKUP($D199,'2. Runde Gruppen'!$D$3:$I$20,5,FALSE),0)","v":0},{"$f":"IFERROR(VLOOKUP($D199,Finals!$B$4:$I$26,2,FALSE),0)","v":0},{"$f":"IFERROR(VLOOKUP($D199,Finals!$B$4:$I$26,8,FALSE),0)","v":0},null,null,null,{"$f":"IFERROR(VLOOKUP($D199,Finals!$J$6:$P$24,2,FALSE),0)","v":0},{"$f":"IFERROR(VLOOKUP($D199,Finals!$J$6:$P$24,7,FALSE),0)","v":0},null,{"$f":"IFERROR(VLOOKUP($D199,Finals!$Q$10:$W$20,2,FALSE),0)","v":0},{"$f":"IFERROR(VLOOKUP($D199,Finals!$Q$10:$W$20,7,FALSE),0)","v":0},{"$f":"IFERROR(VLOOKUP($D199,Finals!$X$14:$AD$15,2,FALSE),0)","v":0},{"$f":"IFERROR(VLOOKUP($D199,Finals!$X$14:$AD$15,7,FALSE),0)","v":0},0,0,0,""]
[null,null,{"$f":"A146","v":31},"",0,0,{"$f":"IFERROR(VLOOKUP($D200,'2. Runde Gruppen'!$D$3:$I$20,4,FALSE),0)","v":0},{"$f":"IFERROR(VLOOKUP($D200,'2. Runde Gruppen'!$D$3:$I$20,5,FALSE),0)","v":0},{"$f":"IFERROR(VLOOKUP($D200,Finals!$B$4:$I$26,2,FALSE),0)","v":0},{"$f":"IFERROR(VLOOKUP($D200,Finals!$B$4:$I$26,8,FALSE),0)","v":0},null,null,null,{"$f":"IFERROR(VLOOKUP($D200,Finals!$J$6:$P$24,2,FALSE),0)","v":0},{"$f":"IFERROR(VLOOKUP($D200,Finals!$J$6:$P$24,7,FALSE),0)","v":0},null,{"$f":"IFERROR(VLOOKUP($D200,Finals!$Q$10:$W$20,2,FALSE),0)","v":0},{"$f":"IFERROR(VLOOKUP($D200,Finals!$Q$10:$W$20,7,FALSE),0)","v":0},{"$f":"IFERROR(VLOOKUP($D200,Finals!$X$14:$AD$15,2,FALSE),0)","v":0},{"$f":"IFERROR(VLOOKUP($D200,Finals!$X$14:$AD$15,7,FALSE),0)","v":0},0,0,0,""]
[null,null,{"$f":"A147","v":32},"",0,0,{"$f":"IFERROR(VLOOKUP($D201,'2. Runde Gruppen'!$D$3:$I$20,4,FALSE),0)","v":0},{"$f":"IFERROR(VLOOKUP($D201,'2. Runde Gruppen'!$D$3:$I$20,5,FALSE),0)","v":0},{"$f":"IFERROR(VLOOKUP($D201,Finals!$B$4:$I$26,2,FALSE),0)","v":0},{"$f":"IFERROR(VLOOKUP($D201,Finals!$B$4:$I$26,8,FALSE),0)","v":0},null,null,null,{"$f":"IFERROR(VLOOKUP($D201,Finals!$J$6:$P$24,2,FALSE),0)","v":0},{"$f":"IFERROR(VLOOKUP($D201,Finals!$J$6:$P$24,7,FALSE),0)","v":0},null,{"$f":"IFERROR(VLOOKUP($D201,Finals!$Q$10:$W$20,2,FALSE),0)","v":0},{"$f":"IFERROR(VLOOKUP($D201,Finals!$Q$10:$W$20,7,FALSE),0)","v":0},{"$f":"IFERROR(VLOOKUP($D201,Finals!$X$14:$AD$15,2,FALSE),0)","v":0},{"$f":"IFERROR(VLOOKUP($D201,Finals!$X$14:$AD$15,7,FALSE),0)","v":0},0,0,0,""]
[null,null,{"$f":"A148","v":33},"",0,0,{"$f":"IFERROR(VLOOKUP($D202,'2. Runde Gruppen'!$D$3:$I$20,4,FALSE),0)","v":0},{"$f":"IFERROR(VLOOKUP($D202,'2. Runde Gruppen'!$D$3:$I$20,5,FALSE),0)","v":0},{"$f":"IFERROR(VLOOKUP($D202,Finals!$B$4:$I$26,2,FALSE),0)","v":0},{"$f":"IFERROR(VLOOKUP($D202,Finals!$B$4:$I$26,8,FALSE),0)","v":0},null,null,null,{"$f":"IFERROR(VLOOKUP($D202,Finals!$J$6:$P$24,2,FALSE),0)","v":0},{"$f":"IFERROR(VLOOKUP($D202,Finals!$J$6:$P$24,7,FALSE),0)","v":0},null,{"$f":"IFERROR(VLOOKUP($D202,Finals!$Q$10:$W$20,2,FALSE),0)","v":0},{"$f":"IFERROR(VLOOKUP($D202,Finals!$Q$10:$W$20,7,FALSE),0)","v":0},{"$f":"IFERROR(VLOOKUP($D202,Finals!$X$14:$AD$15,2,FALSE),0)","v":0},{"$f":"IFERROR(VLOOKUP($D202,Finals!$X$14:$AD$15,7,FALSE),0)","v":0},0,0,0,""]
[null,null,{"$f":"A149","v":34},"",0,0,{"$f":"IFERROR(VLOOKUP($D203,'2. Runde Gruppen'!$D$3:$I$20,4,FALSE),0)","v":0},{"$f":"IFERROR(VLOOKUP($D203,'2. Runde Gruppen'!$D$3:$I$20,5,FALSE),0)","v":0},{"$f":"IFERROR(VLOOKUP($D203,Finals!$B$4:$I$26,2,FALSE),0)","v":0},{"$f":"IFERROR(VLOOKUP($D203,Finals!$B$4:$I$26,8,FALSE),0)","v":0},null,null,null,{"$f":"IFERROR(VLOOKUP($D203,Finals!$J$6:$P$24,2,FALSE),0)","v":0},{"$f":"IFERROR(VLOOKUP($D203,Finals!$J$6:$P$24,7,FALSE),0)","v":0},null,{"$f":"IFERROR(VLOOKUP($D203,Finals!$Q$10:$W$20,2,FALSE),0)","v":0},{"$f":"IFERROR(VLOOKUP($D203,Finals!$Q$10:$W$20,7,FALSE),0)","v":0},{"$f":"IFERROR(VLOOKUP($D203,Finals!$X$14:$AD$15,2,FALSE),0)","v":0},{"$f":"IFERROR(VLOOKUP($D203,Finals!$X$14:$AD$15,7,FALSE),0)","v":0},0,0,0,""]
[null,null,{"$f":"A150","v":35},"",0,0,{"$f":"IFERROR(VLOOKUP($D204,'2. Runde Gruppen'!$D$3:$I$20,4,FALSE),0)","v":0},{"$f":"IFERROR(VLOOKUP($D204,'2. Runde Gruppen'!$D$3:$I$20,5,FALSE),0)","v":0},{"$f":"IFERROR(VLOOKUP($D204,Finals!$B$4:$I$26,2,FALSE),0)","v":0},{"$f":"IFERROR(VLOOKUP($D204,Finals!$B$4:$I$26,8,FALSE),0)","v":0},null,null,null,{"$f":"IFERROR(VLOOKUP($D204,Finals!$J$6:$P$24,2,FALSE),0)","v":0},{"$f":"IFERROR(VLOOKUP($D204,Finals!$J$6:$P$24,7,FALSE),0)","v":0},null,{"$f":"IFERROR(VLOOKUP($D204,Finals!$Q$10:$W$20,2,FALSE),0)","v":0},{"$f":"IFERROR(VLOOKUP($D204,Finals!$Q$10:$W$20,7,FALSE),0)","v":0},{"$f":"IFERROR(VLOOKUP($D204,Finals!$X$14:$AD$15,2,FALSE),0)","v":0},{"$f":"IFERROR(VLOOKUP($D204,Finals!$X$14:$AD$15,7,FALSE),0)","v":0},0,0,0,""]
[null,null,{"$f":"A151","v":36},"",0,0,{"$f":"IFERROR(VLOOKUP($D205,'2. Runde Gruppen'!$D$3:$I$20,4,FALSE),0)","v":0},{"$f":"IFERROR(VLOOKUP($D205,'2. Runde Gruppen'!$D$3:$I$20,5,FALSE),0)","v":0},{"$f":"IFERROR(VLOOKUP($D205,Finals!$B$4:$I$26,2,FALSE),0)","v":0},{"$f":"IFERROR(VLOOKUP($D205,Finals!$B$4:$I$26,8,FALSE),0)","v":0},null,null,null,{"$f":"IFERROR(VLOOKUP($D205,Finals!$J$6:$P$24,2,FALSE),0)","v":0},{"$f":"IFERROR(VLOOKUP($D205,Finals!$J$6:$P$24,7,FALSE),0)","v":0},null,{"$f":"IFERROR(VLOOKUP($D205,Finals!$Q$10:$W$20,2,FALSE),0)","v":0},{"$f":"IFERROR(VLOOKUP($D205,Finals!$Q$10:$W$20,7,FALSE),0)","v":0},{"$f":"IFERROR(VLOOKUP($D205,Finals!$X$14:$AD$15,2,FALSE),0)","v":0},{"$f":"IFERROR(VLOOKUP($D205,Finals!$X$14:$AD$15,7,FALSE),0)","v":0},0,0,0,""]
[null,null,{"$f":"A152","v":37},"",0,0,{"$f":"IFERROR(VLOOKUP($D206,'2. Runde Gruppen'!$D$3:$I$20,4,FALSE),0)","v":0},{"$f":"IFERROR(VLOOKUP($D206,'2. Runde Gruppen'!$D$3:$I$20,5,FALSE),0)","v":0},{"$f":"IFERROR(VLOOKUP($D206,Finals!$B$4:$I$26,2,FALSE),0)","v":0},{"$f":"IFERROR(VLOOKUP($D206,Finals!$B$4:$I$26,8,FALSE),0)","v":0},null,null,null,{"$f":"IFERROR(VLOOKUP($D206,Finals!$J$6:$P$24,2,FALSE),0)","v":0},{"$f":"IFERROR(VLOOKUP($D206,Finals!$J$6:$P$24,7,FALSE),0)","v":0},null,{"$f":"IFERROR(VLOOKUP($D206,Finals!$Q$10:$W$20,2,FALSE),0)","v":0},{"$f":"IFERROR(VLOOKUP($D206,Finals!$Q$10:$W$20,7,FALSE),0)","v":0},{"$f":"IFERROR(VLOOKUP($D206,Finals!$X$14:$AD$15,2,FALSE),0)","v":0},{"$f":"IFERROR(VLOOKUP($D206,Finals!$X$14:$AD$15,7,FALSE),0)","v":0},0,0,0,""]
[null,null,{"$f":"A153","v":38},"",0,0,{"$f":"IFERROR(VLOOKUP($D207,'2. Runde Gruppen'!$D$3:$I$20,4,FALSE),0)","v":0},{"$f":"IFERROR(VLOOKUP($D207,'2. Runde Gruppen'!$D$3:$I$20,5,FALSE),0)","v":0},{"$f":"IFERROR(VLOOKUP($D207,Finals!$B$4:$I$26,2,FALSE),0)","v":0},{"$f":"IFERROR(VLOOKUP($D207,Finals!$B$4:$I$26,8,FALSE),0)","v":0},null,null,null,{"$f":"IFERROR(VLOOKUP($D207,Finals!$J$6:$P$24,2,FALSE),0)","v":0},{"$f":"IFERROR(VLOOKUP($D207,Finals!$J$6:$P$24,7,FALSE),0)","v":0},null,{"$f":"IFERROR(VLOOKUP($D207,Finals!$Q$10:$W$20,2,FALSE),0)","v":0},{"$f":"IFERROR(VLOOKUP($D207,Finals!$Q$10:$W$20,7,FALSE),0)","v":0},{"$f":"IFERROR(VLOOKUP($D207,Finals!$X$14:$AD$15,2,FALSE),0)","v":0},{"$f":"IFERROR(VLOOKUP($D207,Finals!$X$14:$AD$15,7,FALSE),0)","v":0},0,0,0,""]
[null,null,{"$f":"A154","v":39},"",0,0,{"$f":"IFERROR(VLOOKUP($D208,'2. Runde Gruppen'!$D$3:$I$20,4,FALSE),0)","v":0},{"$f":"IFERROR(VLOOKUP($D208,'2. Runde Gruppen'!$D$3:$I$20,5,FALSE),0)","v":0},{"$f":"IFERROR(VLOOKUP($D208,Finals!$B$4:$I$26,2,FALSE),0)","v":0},{"$f":"IFERROR(VLOOKUP($D208,Finals!$B$4:$I$26,8,FALSE),0)","v":0},null,null,null,{"$f":"IFERROR(VLOOKUP($D208,Finals!$J$6:$P$24,2,FALSE),0)","v":0},{"$f":"IFERROR(VLOOKUP($D208,Finals!$J$6:$P$24,7,FALSE),0)","v":0},null,{"$f":"IFERROR(VLOOKUP($D208,Finals!$Q$10:$W$20,2,FALSE),0)","v":0},{"$f":"IFERROR(VLOOKUP($D208,Finals!$Q$10:$W$20,7,FALSE),0)","v":0},{"$f":"IFERROR(VLOOKUP($D208,Finals!$X$14:$AD$15,2,FALSE),0)","v":0},{"$f":"IFERROR(VLOOKUP($D208,Finals!$X$14:$AD$15,7,FALSE),0)","v":0},0,0,0,""]
[null,null,{"$f":"A155","v":40},"",0,0,{"$f":"IFERROR(VLOOKUP($D209,'2. Runde Gruppen'!$D$3:$I$20,4,FALSE),0)","v":0},{"$f":"IFERROR(VLOOKUP($D209,'2. Runde Gruppen'!$D$3:$I$20,5,FALSE),0)","v":0},{"$f":"IFERROR(VLOOKUP($D209,Finals!$B$4:$I$26,2,FALSE),0)","v":0},{"$f":"IFERROR(VLOOKUP($D209,Finals!$B$4:$I$26,8,FALSE),0)","v":0},null,null,null,{"$f":"IFERROR(VLOOKUP($D209,Finals!$J$6:$P$24,2,FALSE),0)","v":0},{"$f":"IFERROR(VLOOKUP($D209,Finals!$J$6:$P$24,7,FALSE),0)","v":0},null,{"$f":"IFERROR(VLOOKUP($D209,Finals!$Q$10:$W$20,2,FALSE),0)","v":0},{"$f":"IFERROR(VLOOKUP($D209,Finals!$Q$10:$W$20,7,FALSE),0)","v":0},{"$f":"IFERROR(VLOOKUP($D209,Finals!$X$14:$AD$15,2,FALSE),0)","v":0},{"$f":"IFERROR(VLOOKUP($D209,Finals!$X$14:$AD$15,7,FALSE),0)","v":0},0,0,0,""]

{"sheet":"2. Runde Gruppen","index":4,"n_rows":27,"n_cols":43,"rows_kept":27,"cut":false,"hidden":true,"merged":[[6,21,6,24],[11,21,11,24],[16,21,16,24],[6,31,6,34],[11,31,11,34],[16,31,16,34],[6,0,9,0],[11,0,14,0],[14,19,14,20],[16,0,19,0],[12,19,12,20],[13,19,13,20],[16,19,16,20],[17,19,17,20],[18,19,18,20],[19,19,19,20],[6,19,6,20],[7,19,7,20],[8,19,8,20],[9,19,9,20],[11,19,11,20],[0,3,0,31],[1,0,4,0],[1,19,1,20],[2,19,2,20],[3,19,3,20],[4,19,4,20],[1,31,1,34],[1,21,1,24]]}
[{"$f":"Spieler!S12","v":24},null,null,"Zwischenrunde R2 - 3 Länder Ranking (GST-Serie)"]
["A",null,"R2","Spieler","M","W","L","F+","F-",null,null,null,"Rang","Rang","P+",null,null,null,"Spieler","Spieler",null,"Breaks 30+",null,null,null,"F+","F-",null,null,null,null,"Breaks 30+",null,null,null,null,null,null,null,null,null,null,"Freigabe-Code Finals"]
[null,"A1",{"$f":"IF(AND(Spieler!$AG$1=\"X\",Spieler!$S$12<21),\"\",'2. Runde Gruppen'!B3)","v":"A1"},{"$f":"IFERROR(IF(C3=\"\",\"\",IF(AND(Spieler!AG1=\"X\",Spieler!AG2<21),\"\",VLOOKUP(B3,Berechnung!$CP$90:$CQ$101,2,FALSE))),\"\")","v":"Gärtner David"},{"$f":"AB3+AB4","v":0},{"$f":"AC3+AC4","v":0},{"$f":"AD3+AD4","v":0},{"$f":"Z3+Z4","v":0},{"$f":"AA3+AA4","v":0},null,null,null,{"$f":"IF(D3=\"\",(-90000),(F3*1000)+(H3*100)+E3-(G3*500)-(I3*50)+O3)","v":0},{"$f":"IF(E3=0,\"\",RANK(M3,M3:M5))","v":""},null,{"$f":"IF(D3=\"\",\"\",D3)","v":"Gärtner David"},null,1,{"$f":"D3","v":"Gärtner David"},{"$f":"D4","v":"Delling Tino"},null,null,null,null,null,null,null,null,null,null,null,null,null,null,null,{"$f":"IFERROR(LARGE(V3:Y3,1),\"\")","v":""},{"$f":"S3","v":"Gärtner David"},{"$f":"IFERROR(LARGE(AF3:AI3,1),\"\")","v":""},{"$f":"T3","v":"Delling Tino"},{"$f":"IF(V3>0,1)+IF(W3>0,1)+IF(X3>0,1)+IF(Y3>0,1)","v":0},{"$f":"IF(AF3>0,1)+IF(AG3>0,1)+IF(AH3>0,1)+IF(AI3>0,1)","v":0}]
[null,"A2",{"$f":"IF(AND(Spieler!$AG$1=\"X\",Spieler!$S$12<21),\"\",'2. Runde Gruppen'!B4)","v":"A2"},{"$f":"IFERROR(IF(C3=\"\",\"\",IF(AND(Spieler!AG1=\"X\",Spieler!AG2<21),\"\",VLOOKUP(B4,Berechnung!$CP$90:$CQ$101,2,FALSE))),\"\")","v":"Delling Tino"},{"$f":"AB3+AB5","v":0},{"$f":"AD3+AC5","v":0},{"$f":"AC3+AD5","v":0},{"$f":"AA3+Z5","v":0},{"$f":"Z3+AA5","v":0},null,null,null,{"$f":"IF(D4=\"\",(-90000),(F4*1000)+(H4*100)+E4-(G4*500)-(I4*50)+O4)","v":0},{"$f":"IF(E4=0,\"\",RANK(M4,M3:M5))","v":""},null,{"$f":"IF(D4=\"\",\"\",D4)","v":"Delling Tino"},null,2,{"$f":"D3","v":"Gärtner David"},{"$f":"D5","v":"Behling Oliver"},null,null,null,null,null,null,null,{"$f":"IF(Z4+AA4>0,1,0)","v":0},{"$f":"IF(Z4>AA4,1,0)","v":0},{"$f":"IF(AA4>Z4,1,0)","v":0},null,null,null,null,null,{"$f":"IFERROR(LARGE(V4:Y4,1),\"\")","v":""},{"$f":"S4","v":"Gärtner David"},{"$f":"IFERROR(LARGE(AF4:AI4,1),\"\")","v":""},{"$f":"T4","v":"Behling Oliver"},{"$f":"IF(V4>0,1)+IF(W4>0,1)+IF(X4>0,1)+IF(Y4>0,1)","v":0},{"$f":"IF(AF4>0,1)+IF(AG4>0,1)+IF(AH4>0,1)+IF(AI4>0,1)","v":0}]
[null,"A3",{"$f":"IF(AND(Spieler!$AG$1=\"X\",Spieler!$S$12<21),\"\",'2. Runde Gruppen'!B5)","v":"A3"},{"$f":"IFERROR(IF(C3=\"\",\"\",IF(AND(Spieler!AG1=\"X\",Spieler!AG2<21),\"\",VLOOKUP(B9,Berechnung!$CP$90:$CQ$101,2,FALSE))),\"\")","v":"Behling Oliver"},{"$f":"AB4+AB5","v":0},{"$f":"AD4+AD5","v":0},{"$f":"AC4+AC5","v":0},{"$f":"AA4+AA5","v":0},{"$f":"Z4+Z5","v":0},null,null,null,{"$f":"IF(D5=\"\",(-90000),(F5*1000)+(H5*100)+E5-(G5*500)-(I5*50)+O5)","v":0},{"$f":"IF(E5=0,\"\",RANK(M5,M3:M5))","v":""},null,{"$f":"IF(D5=\"\",\"\",D5)","v":"Behling Oliver"},null,3,{"$f":"D4","v":"Delling Tino"},{"$f":"D5","v":"Behling Oliver"},null,null,null,null,null,null,null,{"$f":"IF(Z5+AA5>0,1,0)","v":0},{"$f":"IF(Z5>AA5,1,0)","v":0},{"$f":"IF(AA5>Z5,1,0)","v":0},null,null,null,null,null,{"$f":"IFERROR(LARGE(V5:Y5,1),\"\")","v":""},"Delling Tino",{"$f":"IFERROR(LARGE(AF5:AI5,1),\"\")","v":""},"Behling Oliver",{"$f":"IF(V5>0,1)+IF(W5>0,1)+IF(X5>0,1)+IF(Y5>0,1)","v":0},{"$f":"IF(AF5>0,1)+IF(AG5>0,1)+IF(AH5>0,1)+IF(AI5>0,1)","v":0}]
[]
["B",null,"R2","Spieler","M","W","L","F+","F-",null,null,null,"Rang","Rang","P+",null,null,null,"Spieler","Spieler",null,"Breaks 30+",null,null,null,"F+","F-",null,null,null,null,"Breaks 30+"]
[null,"B1",{"$f":"IF(AND(Spieler!$AG$1=\"X\",Spieler!$S$12<21),\"\",'2. Runde Gruppen'!B8)","v":"B1"},{"$f":"IFERROR(IF(C3=\"\",\"\",IF(AND(Spieler!AG1=\"X\",Spieler!AG2<21),\"\",VLOOKUP(B8,Berechnung!$CP$90:$CQ$101,2,FALSE))),\"\")","v":"Weber Marco"},{"$f":"AB8+AB9","v":0},{"$f":"AC8+AC9","v":0},{"$f":"AD8+AD9","v":0},{"$f":"Z8+Z9","v":0},{"$f":"AA8+AA9","v":0},null,null,null,{"$f":"IF(D8=\"\",(-90000),(F8*1000)+(H8*100)+E8-(G8*500)-(I8*50)+O8)","v":0},{"$f":"IF(E8=0,\"\",RANK(M8,M8:M10))","v":""},null,{"$f":"IF(D8=\"\",\"\",D8)","v":"Weber Marco"},null,1,{"$f":"D8","v":"Weber Marco"},{"$f":"D9","v":"Suttner Magnus"},null,null,null,null,null,null,null,{"$f":"IF(Z8+AA8>0,1,0)","v":0},{"$f":"IF(Z8>AA8,1,0)","v":0},{"$f":"IF(AA8>Z8,1,0)","v":0},null,null,null,null,null,{"$f":"IFERROR(LARGE(V8:Y8,1),\"\")","v":""},"Weber Marco",{"$f":"IFERROR(LARGE(AF8:AI8,1),\"\")","v":""},"Suttner Magnus",{"$f":"IF(V8>0,1)+IF(W8>0,1)+IF(X8>0,1)+IF(Y8>0,1)","v":0},{"$f":"IF(AF8>0,1)+IF(AG8>0,1)+IF(AH8>0,1)+IF(AI8>0,1)","v":0}]
[null,"B2",{"$f":"IF(AND(Spieler!$AG$1=\"X\",Spieler!$S$12<21),\"\",'2. Runde Gruppen'!B9)","v":"B2"},{"$f":"IFERROR(IF(C3=\"\",\"\",IF(AND(Spieler!AG1=\"X\",Spieler!AG2<21),\"\",VLOOKUP(B5,Berechnung!$CP$90:$CQ$101,2,FALSE))),\"\")","v":"Suttner Magnus"},{"$f":"AB8+AB10","v":0},{"$f":"AD8+AC10","v":0},{"$f":"AC8+AD10","v":0},{"$f":"AA8+Z10","v":0},{"$f":"Z8+AA10","v":0},null,null,null,{"$f":"IF(D9=\"\",(-90000),(F9*1000)+(H9*100)+E9-(G9*500)-(I9*50)+O9)","v":0},{"$f":"IF(E9=0,\"\",RANK(M9,M8:M10))","v":""},null,{"$f":"IF(D9=\"\",\"\",D9)","v":"Suttner Magnus"},null,2,{"$f":"D8","v":"Weber Marco"},{"$f":"D10","v":"Müller Marcus"},null,null,null,null,null,null,null,{"$f":"IF(Z9+AA9>0,1,0)","v":0},{"$f":"IF(Z9>AA9,1,0)","v":0},{"$f":"IF(AA9>Z9,1,0)","v":0},null,null,null,null,null,{"$f":"IFERROR(LARGE(V9:Y9,1),\"\")","v":""},"Weber Marco",{"$f":"IFERROR(LARGE(AF9:AI9,1),\"\")","v":""},"Müller Marcus",{"$f":"IF(V9>0,1)+IF(W9>0,1)+IF(X9>0,1)+IF(Y9>0,1)","v":0},{"$f":"IF(AF9>0,1)+IF(AG9>0,1)+IF(AH9>0,1)+IF(AI9>0,1)","v":0}]
[null,"B3",{"$f":"IF(AND(Spieler!$AG$1=\"X\",Spieler!$S$12<21),\"\",'2. Runde Gruppen'!B10)","v":"B3"},{"$f":"IFERROR(IF(C3=\"\",\"\",IF(AND(Spieler!AG1=\"X\",Spieler!AG2<21),\"\",VLOOKUP(B15,Berechnung!$CP$90:$CQ$101,2,FALSE))),\"\")","v":"Müller Marcus"},{"$f":"AB9+AB10","v":0},{"$f":"AD9+AD10","v":0},{"$f":"AC9+AC10","v":0},{"$f":"AA9+AA10","v":0},{"$f":"Z9+Z10","v":0},null,null,null,{"$f":"IF(D10=\"\",(-90000),(F10*1000)+(H10*100)+E10-(G10*500)-(I10*50)+O10)","v":0},{"$f":"IF(E10=0,\"\",RANK(M10,M8:M10))","v":""},null,{"$f":"IF(D10=\"\",\"\",D10)","v":"Müller Marcus"},null,3,{"$f":"D9","v":"Suttner Magnus"},{"$f":"D10","v":"Müller Marcus"},null,null,null,null,null,null,null,{"$f":"IF(Z10+AA10>0,1,0)","v":0},{"$f":"IF(Z10>AA10,1,0)","v":0},{"$f":"IF(AA10>Z10,1,0)","v":0},null,null,null,null,null,{"$f":"IFERROR(LARGE(V10:Y10,1),\"\")","v":""},"Suttner Magnus",{"$f":"IFERROR(LARGE(AF10:AI10,1),\"\")","v":""},"Müller Marcus",{"$f":"IF(V10>0,1)+IF(W10>0,1)+IF(X10>0,1)+IF(Y10>0,1)","v":0},{"$f":"IF(AF10>0,1)+IF(AG10>0,1)+IF(AH10>0,1)+IF(AI10>0,1)","v":0}]
[]
["C",null,"R2","Spieler","M","W","L","F+","F-",null,null,null,"Rang","Rang","P+",null,null,null,"Spieler","Spieler",null,"Breaks 30+",null,null,null,"F+","F-",null,null,null,null,"Breaks 30+"]
[null,"C1",{"$f":"IF(AND(Spieler!$AG$1=\"X\",Spieler!$S$12<21),\"\",'2. Runde Gruppen'!B13)","v":"C1"},{"$f":"IFERROR(IF(C3=\"\",\"\",IF(AND(Spieler!AG1=\"X\",Spieler!AG2<21),\"\",VLOOKUP(B13,Berechnung!$CP$90:$CQ$101,2,FALSE))),\"\")","v":"Witzik Oliver"},{"$f":"AB13+AB14","v":0},{"$f":"AC13+AC14","v":0},{"$f":"AD13+AD14","v":0},{"$f":"Z13+Z14","v":0},{"$f":"AA13+AA14","v":0},null,null,null,{"$f":"IF(D13=\"\",(-90000),(F13*1000)+(H13*100)+E13-(G13*500)-(I13*50)+O13)","v":0},{"$f":"IF(E13=0,\"\",RANK(M13,M13:M15))","v":""},null,{"$f":"IF(D13=\"\",\"\",D13)","v":"Witzik Oliver"},null,1,{"$f":"D13","v":"Witzik Oliver"},{"$f":"D14","v":"Valderrama Salvador"},null,null,null,null,null,null,null,null,null,null,null,null,null,null,null,{"$f":"IFERROR(LARGE(V13:Y13,1),\"\")","v":""},"Witzik Oliver",{"$f":"IFERROR(LARGE(AF13:AI13,1),\"\")","v":""},"Valderrama Salvador",{"$f":"IF(V13>0,1)+IF(W13>0,1)+IF(X13>0,1)+IF(Y13>0,1)","v":0},{"$f":"IF(AF13>0,1)+IF(AG13>0,1)+IF(AH13>0,1)+IF(AI13>0,1)","v":0}]
[null,"C2",{"$f":"IF(AND(Spieler!$AG$1=\"X\",Spieler!$S$12<21),\"\",'2. Runde Gruppen'!B14)","v":"C2"},{"$f":"IFERROR(IF(C3=\"\",\"\",IF(AND(Spieler!AG1=\"X\",Spieler!AG2<21),\"\",VLOOKUP(B14,Berechnung!$CP$90:$CQ$101,2,FALSE))),\"\")","v":"Valderrama Salvador"},{"$f":"AB13+AB15","v":0},{"$f":"AD13+AC15","v":0},{"$f":"AC13+AD15","v":0},{"$f":"AA13+Z15","v":0},{"$f":"Z13+AA15","v":0},null,null,null,{"$f":"IF(D14=\"\",(-90000),(F14*1000)+(H14*100)+E14-(G14*500)-(I14*50)+O14)","v":0},{"$f":"IF(E14=0,\"\",RANK(M14,M13:M15))","v":""},null,{"$f":"IF(D14=\"\",\"\",D14)","v":"Valderrama Salvador"},null,2,{"$f":"D13","v":"Witzik Oliver"},{"$f":"D15","v":"Fandrei Andreas"},null,null,null,null,null,null,null,{"$f":"IF(Z14+AA14>0,1,0)","v":0},{"$f":"IF(Z14>AA14,1,0)","v":0},{"$f":"IF(AA14>Z14,1,0)","v":0},null,null,null,null,null,{"$f":"IFERROR(LARGE(V14:Y14,1),\"\")","v":""},"Witzik Oliver",{"$f":"IFERROR(LARGE(AF14:AI14,1),\"\")","v":""},"Fandrei Andreas",{"$f":"IF(V14>0,1)+IF(W14>0,1)+IF(X14>0,1)+IF(Y14>0,1)","v":0},{"$f":"IF(AF14>0,1)+IF(AG14>0,1)+IF(AH14>0,1)+IF(AI14>0,1)","v":0}]
[null,"C3",{"$f":"IF(AND(Spieler!$AG$1=\"X\",Spieler!$S$12<21),\"\",'2. Runde Gruppen'!B15)","v":"C3"},{"$f":"IFERROR(IF(C3=\"\",\"\",IF(AND(Spieler!AG1=\"X\",Spieler!AG2<21),\"\",VLOOKUP(B10,Berechnung!$CP$90:$CQ$101,2,FALSE))),\"\")","v":"Fandrei Andreas"},{"$f":"AB14+AB15","v":0},{"$f":"AD14+AD15","v":0},{"$f":"AC14+AC15","v":0},{"$f":"AA14+AA15","v":0},{"$f":"Z14+Z15","v":0},null,null,null,{"$f":"IF(D15=\"\",(-90000),(F15*1000)+(H15*100)+E15-(G15*500)-(I15*50)+O15)","v":0},{"$f":"IF(E15=0,\"\",RANK(M15,M13:M15))","v":""},null,{"$f":"IF(D15=\"\",\"\",D15)","v":"Fandrei Andreas"},null,3,{"$f":"D14","v":"Valderrama Salvador"},{"$f":"D15","v":"Fandrei Andreas"},null,null,null,null,null,null,null,{"$f":"IF(Z15+AA15>0,1,0)","v":0},{"$f":"IF(Z15>AA15,1,0)","v":0},{"$f":"IF(AA15>Z15,1,0)","v":0},null,null,null,null,null,{"$f":"IFERROR(LARGE(V15:Y15,1),\"\")","v":""},"Valderrama Salvador",{"$f":"IFERROR(LARGE(AF15:AI15,1),\"\")","v":""},"Fandrei Andreas",{"$f":"IF(V15>0,1)+IF(W15>0,1)+IF(X15>0,1)+IF(Y15>0,1)","v":0},{"$f":"IF(AF15>0,1)+IF(AG15>0,1)+IF(AH15>0,1)+IF(AI15>0,1)","v":0}]
[]
["D",null,"R2","Spieler","M","W","L","F+","F-",null,null,null,"Rang","Rang","P+",null,null,null,"Spieler","Spieler",null,"Breaks 30+",null,null,null,"F+","F-",null,null,null,null,"Breaks 30+"]
[null,"D1",{"$f":"IF(AND(Spieler!$AG$1=\"X\",Spieler!$S$12<21),\"\",'2. Runde Gruppen'!B18)","v":"D1"},{"$f":"IFERROR(IF(C3=\"\",\"\",IF(AND(Spieler!AG1=\"X\",Spieler!AG2<21),\"\",VLOOKUP(B18,Berechnung!$CP$90:$CQ$101,2,FALSE))),\"\")","v":"Straßburger Marko"},{"$f":"AB18+AB19","v":0},{"$f":"AC18+AC19","v":0},{"$f":"AD18+AD19","v":0},{"$f":"Z18+Z19","v":0},{"$f":"AA18+AA19","v":0},null,null,null,{"$f":"IF(D18=\"\",(-90000),(F18*1000)+(H18*100)+E18-(G18*500)-(I18*50)+O18)","v":0},{"$f":"IF(E18=0,\"\",RANK(M18,M18:M20))","v":""},null,{"$f":"IF(D18=\"\",\"\",D18)","v":"Straßburger Marko"},null,1,{"$f":"D18","v":"Straßburger Marko"},{"$f":"D19","v":"Jeroch Paul"},null,null,null,null,null,null,null,{"$f":"IF(Z18+AA18>0,1,0)","v":0},{"$f":"IF(Z18>AA18,1,0)","v":0},{"$f":"IF(AA18>Z18,1,0)","v":0},null,null,null,null,null,{"$f":"IFERROR(LARGE(V18:Y18,1),\"\")","v":""},"Straßburger Marko",{"$f":"IFERROR(LARGE(AF18:AI18,1),\"\")","v":""},"Jeroch Paul",{"$f":"IF(V18>0,1)+IF(W18>0,1)+IF(X18>0,1)+IF(Y18>0,1)","v":0},{"$f":"IF(AF18>0,1)+IF(AG18>0,1)+IF(AH18>0,1)+IF(AI18>0,1)","v":0}]
[null,"D2",{"$f":"IF(AND(Spieler!$AG$1=\"X\",Spieler!$S$12<21),\"\",'2. Runde Gruppen'!B19)","v":"D2"},{"$f":"IFERROR(IF(C3=\"\",\"\",IF(AND(Spieler!AG1=\"X\",Spieler!AG2<21),\"\",VLOOKUP(B19,Berechnung!$CP$90:$CQ$101,2,FALSE))),\"\")","v":"Jeroch Paul"},{"$f":"AB18+AB20","v":0},{"$f":"AD18+AC20","v":0},{"$f":"AC18+AD20","v":0},{"$f":"AA18+Z20","v":0},{"$f":"Z18+AA20","v":0},null,null,null,{"$f":"IF(D19=\"\",(-90000),(F19*1000)+(H19*100)+E19-(G19*500)-(I19*50)+O19)","v":0},{"$f":"IF(E19=0,\"\",RANK(M19,M18:M20))","v":""},null,{"$f":"IF(D19=\"\",\"\",D19)","v":"Jeroch Paul"},null,2,{"$f":"D18","v":"Straßburger Marko"},{"$f":"D20","v":"Drahn Robert"},null,null,null,null,null,null,null,{"$f":"IF(Z19+AA19>0,1,0)","v":0},{"$f":"IF(Z19>AA19,1,0)","v":0},{"$f":"IF(AA19>Z19,1,0)","v":0},null,null,null,null,null,{"$f":"IFERROR(LARGE(V19:Y19,1),\"\")","v":""},"Straßburger Marko",{"$f":"IFERROR(LARGE(AF19:AI19,1),\"\")","v":""},"Drahn Robert",{"$f":"IF(V19>0,1)+IF(W19>0,1)+IF(X19>0,1)+IF(Y19>0,1)","v":0},{"$f":"IF(AF19>0,1)+IF(AG19>0,1)+IF(AH19>0,1)+IF(AI19>0,1)","v":0}]
[null,"D3",{"$f":"IF(AND(Spieler!$AG$1=\"X\",Spieler!$S$12<21),\"\",'2. Runde Gruppen'!B20)","v":"D3"},{"$f":"IFERROR(IF(C3=\"\",\"\",IF(AND(Spieler!AG1=\"X\",Spieler!AG2<21),\"\",VLOOKUP(B20,Berechnung!$CP$90:$CQ$101,2,FALSE))),\"\")","v":"Drahn Robert"},{"$f":"AB19+AB20","v":0},{"$f":"AD19+AD20","v":0},{"$f":"AC19+AC20","v":0},{"$f":"AA19+AA20","v":0},{"$f":"Z19+Z20","v":0},null,null,null,{"$f":"IF(D20=\"\",(-90000),(F20*1000)+(H20*100)+E20-(G20*500)-(I20*50)+O20)","v":0},{"$f":"IF(E20=0,\"\",RANK(M20,M18:M20))","v":""},null,{"$f":"IF(D20=\"\",\"\",D20)","v":"Drahn Robert"},null,3,{"$f":"D19","v":"Jeroch Paul"},{"$f":"D20","v":"Drahn Robert"},null,null,null,null,null,null,null,{"$f":"IF(Z20+AA20>0,1,0)","v":0},{"$f":"IF(Z20>AA20,1,0)","v":0},{"$f":"IF(AA20>Z20,1,0)","v":0},null,null,null,null,null,{"$f":"IFERROR(LARGE(V20:Y20,1),\"\")","v":""},"Jeroch Paul",{"$f":"IFERROR(LARGE(AF20:AI20,1),\"\")","v":""},"Drahn Robert",{"$f":"IF(V20>0,1)+IF(W20>0,1)+IF(X20>0,1)+IF(Y20>0,1)","v":0},{"$f":"IF(AF20>0,1)+IF(AG20>0,1)+IF(AH20>0,1)+IF(AI20>0,1)","v":0}]
[null,null,null,null,null,null,null,null,null,null,null,null,null,null,null,null,null,null,null,null,null,null,null,null,null,null,null,null,null,null,null,null,null,null,null,{"$f":"IFERROR(LARGE(AJ3:AJ20,1),0)","v":0},null,{"$f":"IFERROR(LARGE(AL3:AL20,1),0)","v":0},null,{"$f":"SUM(AN3:AN20)","v":0},{"$f":"SUM(AO3:AO20)","v":0}]
[]
[null,null,null,null,null,null,null,null,null,null,null,null,null,null,null,null,null,null,null,null,null,null,null,null,null,{"$f":"SUM(Z3:AA20)","v":0},null,null,null,null,null,null,null,null,"HB",{"$f":"IFERROR(IF(AND(AJ21=0,AL21=0),\"\",IF(AJ21>AL21,AJ21,AL21)),\"\")","v":""}]
[null,null,null,null,null,null,null,null,null,null,null,null,null,null,null,null,null,null,null,null,null,null,null,null,null,null,null,null,null,null,null,null,null,null,"Anzahl",{"$f":"AN21+AO21","v":0}]
[null,null,null,null,null,null,null,null,null,null,null,null,null,null,null,null,null,null,null,null,null,null,null,null,null,null,null,null,null,null,null,null,null,null,1,{"$f":"IFERROR(VLOOKUP(AJ21,AJ3:AK20,2,FALSE),\"\")","v":""}]
[null,null,null,null,null,null,null,null,null,null,null,null,null,null,null,null,null,null,null,null,null,null,null,null,null,null,null,null,null,null,null,null,null,null,2,{"$f":"IFERROR(VLOOKUP(AL21,AL3:AM20,2,FALSE),\"\")","v":""}]
[null,null,null,null,null,null,null,null,null,null,null,null,null,null,null,null,null,null,null,null,null,null,null,null,null,null,null,null,null,null,null,null,null,null,"HB",{"$f":"IFERROR(IF(AND(AJ21=0,AL21=0),\"\",IF(AJ21>AL21,AJ25,AJ26)),\"\")","v":""}]

{"sheet":"Finals","index":5,"n_rows":64,"n_cols":37,"rows_kept":64,"cut":false,"hidden":false,"merged":[[25,16,25,20],[32,1,33,28],[24,16,24,20],[24,0,25,0],[12,25,12,28],[21,25,21,28],[21,11,21,13],[15,0,16,0],[18,0,19,0],[21,0,22,0],[22,7,23,7],[16,7,17,7],[18,14,19,14],[17,18,17,20],[15,11,15,13],[28,1,31,28],[11,7,12,7],[1,3,1,5],[9,14,10,14],[1,24,2,29],[1,21,2,23],[8,18,8,20],[5,7,6,7],[3,0,4,0],[0,31,0,36],[6,0,7,0],[9,0,10,0],[12,0,13,0],[8,25,8,29],[1,18,1,20],[1,11,1,13],[0,1,0,29],[3,24,3,29],[5,24,5,29],[7,24,7,29],[4,25,4,29],[6,25,6,29],[4,11,4,13],[10,11,10,13]]}
[{"$f":"Spieler!S12","v":24},"Finals - 3 Länder Ranking - GST Serie",null,null,null,null,null,null,null,null,null,null,null,null,null,null,null,null,null,null,null,null,null,null,null,null,null,null,null,null,null,"Ranking"]
[{"$f":"Spieler!AG1","v":"X"},"Achtelfinals","Bo3","Break 30+",null,null,null,null,null,"Viertelfinals",null,null,null,null,null,null,null,null,null,null,null,"Platzierung",null,null,"Auswertung",null,null,null,null,null,null,"Pl.","Spieler","Pkt.","Quote %","F+","F-"]
[]
[1,{"$f":"IFERROR(IF(AND($A$1=24,$A$2=\"\"),\"\",IF($A$1>23,VLOOKUP(1,'1. Runde Gruppen'!$N$3:$P$7,3,FALSE),\"\")),\"\")","v":"Gärtner David"},2,null,null,null,{"$f":"B4","v":"Gärtner David"},null,{"$f":"C5","v":0},{"$f":"D4","v":0},null,null,null,null,null,null,null,null,null,null,null,"1.",null,{"$f":"IF(Y14=Y15,\"\",IF(Y15>Y14,X15,X14))","v":"Weber Marco"},"Highbreak R1",null,null,null,null,null,null,{"$f":"IFERROR(Berechnung!BO116,\"\")","v":1},{"$f":"IFERROR(IF(Spieler!$I$2=\"\",\"\",Berechnung!BP116),\"\")","v":"Weber Marco"},{"$f":"IFERROR(IF(Spieler!$S$11=\"SR\",Berechnung!BT116,Berechnung!BQ116),\"\")","v":410.00360000000001},{"$f":"IFERROR(VLOOKUP(AG4,Berechnung!$D$170:$X$209,21,FALSE),\"\")","v":1},{"$f":"IFERROR(IF(AG4=\"\",\"\",VLOOKUP(AG4,Berechnung!$D$170:$V$209,18,FALSE)),\"\")","v":12},{"$f":"IFERROR(IF(AG4=\"\",\"\",VLOOKUP(AG4,Berechnung!$D$170:$V$209,19,FALSE)),\"\")","v":0}]
[null,"Fandrei Andreas",0,null,null,null,{"$f":"B5","v":"Fandrei Andreas"},null,{"$f":"C4","v":2},{"$f":"D5","v":0},"Bo3","Break 30+",null,null,null,null,null,null,null,null,null,"2.",null,{"$f":"IF(Y14=Y15,\"\",IF(Y15>Y14,X14,X15))","v":"Jeroch Paul"},{"$f":"Matches!AB85","v":63},{"$f":"Matches!AB84","v":"Jeroch Paul"},null,null,null,null,null,{"$f":"IFERROR(Berechnung!BO117,\"\")","v":2},{"$f":"IFERROR(IF(Spieler!$I$2=\"\",\"\",Berechnung!BP117),\"\")","v":"Jeroch Paul"},{"$f":"IFERROR(IF(Spieler!$S$11=\"SR\",Berechnung!BT117,Berechnung!BQ117),\"\")","v":350.00560000000002},{"$f":"IFERROR(VLOOKUP(AG5,Berechnung!$D$170:$X$209,21,FALSE),\"\")","v":0.66666666666666663},{"$f":"IFERROR(IF(AG5=\"\",\"\",VLOOKUP(AG5,Berechnung!$D$170:$V$209,18,FALSE)),\"\")","v":10},{"$f":"IFERROR(IF(AG5=\"\",\"\",VLOOKUP(AG5,Berechnung!$D$170:$V$209,19,FALSE)),\"\")","v":5}]
[null,null,null,null,null,null,null,1,null,{"$f":"IFERROR(IF(AND($A$1=24,$A$2=\"\"),VLOOKUP(1,'2. Runde Gruppen'!N3:P5,3,FALSE),IF(AND(Spieler!AG1=\"X\",Spieler!S12<21),VLOOKUP(1,'1. Runde Gruppen'!N3:P7,3,FALSE),IF(AND(A1>11,A1<17),VLOOKUP(1,'1. Runde Gruppen'!$N$3:$P$7,3,FALSE),IF(A1=11,VLOOKUP(1,'1. Runde Gruppen'!$N$3:$P$7,3,FALSE),IF(AND($A$1>16,$A$1<24),VLOOKUP(1,'2. Runde Gruppen'!$N$3:$P$5,3,FALSE),IF(C4=C5,\"\",IF(C4>C5,B4,B5))))))),\"\")","v":"Gärtner David"},0,null,null,null,{"$f":"J6","v":"Gärtner David"},{"$f":"K7","v":2},null,null,null,null,null,"3.",null,{"$f":"X23","v":"Müller Marcus"},"Highbreak R2",null,null,null,null,null,null,{"$f":"IFERROR(Berechnung!BO118,\"\")","v":3},{"$f":"IFERROR(IF(Spieler!$I$2=\"\",\"\",Berechnung!BP118),\"\")","v":"Fandrei Joel"},{"$f":"IFERROR(IF(Spieler!$S$11=\"SR\",Berechnung!BT118,Berechnung!BQ118),\"\")","v":275.00659999999999},{"$f":"IFERROR(VLOOKUP(AG6,Berechnung!$D$170:$X$209,21,FALSE),\"\")","v":0.6428571428571429},{"$f":"IFERROR(IF(AG6=\"\",\"\",VLOOKUP(AG6,Berechnung!$D$170:$V$209,18,FALSE)),\"\")","v":9},{"$f":"IFERROR(IF(AG6=\"\",\"\",VLOOKUP(AG6,Berechnung!$D$170:$V$209,19,FALSE)),\"\")","v":5}]
[2,{"$f":"IFERROR(IF(AND($A$1=24,$A$2=\"\"),\"\",IF($A$1>23,VLOOKUP(1,'1. Runde Gruppen'!$AD$3:$AF$7,3,FALSE),\"\")),\"\")","v":"Weber Marco"},2,35,64,null,"Weber Marco",null,{"$f":"C8","v":0},{"$f":"IFERROR(IF(AND($A$1=24,$A$2=\"\"),VLOOKUP(2,'2. Runde Gruppen'!N18:P20,3,FALSE),IF(AND(Spieler!AG1=\"X\",Spieler!S12<21),VLOOKUP(2,'1. Runde Gruppen'!AD11:AF15,3,FALSE),IF(AND(A1>11,A1<17),VLOOKUP(2,'1. Runde Gruppen'!$AD$11:$AF$15,3,FALSE),IF(A1=11,VLOOKUP(2,'1. Runde Gruppen'!$N$11:$P$15,3,FALSE),IF(AND($A$1>16,$A$1<24),VLOOKUP(2,'2. Runde Gruppen'!$N$18:$P$20,3,FALSE),IF(C7=C8,\"\",IF(C7>C8,B7,B8))))))),\"\")","v":"Weber Marco"},2,null,null,null,{"$f":"J7","v":"Weber Marco"},{"$f":"K6","v":0},null,null,null,null,null,"3.",null,{"$f":"X24","v":"Fandrei Joel"},{"$f":"'2. Runde Gruppen'!AJ23","v":""},{"$f":"'2. Runde Gruppen'!AJ27","v":""},null,null,null,null,null,{"$f":"IFERROR(Berechnung!BO119,\"\")","v":4},{"$f":"IFERROR(IF(Spieler!$I$2=\"\",\"\",Berechnung!BP119),\"\")","v":"Müller Marcus"},{"$f":"IFERROR(IF(Spieler!$S$11=\"SR\",Berechnung!BT119,Berechnung!BQ119),\"\")","v":260.0052},{"$f":"IFERROR(VLOOKUP(AG7,Berechnung!$D$170:$X$209,21,FALSE),\"\")","v":0.54545454545454541},{"$f":"IFERROR(IF(AG7=\"\",\"\",VLOOKUP(AG7,Berechnung!$D$170:$V$209,18,FALSE)),\"\")","v":6},{"$f":"IFERROR(IF(AG7=\"\",\"\",VLOOKUP(AG7,Berechnung!$D$170:$V$209,19,FALSE)),\"\")","v":5}]
[null,"Hofmann Frank",0,null,null,null,"Hofmann Frank",null,{"$f":"C7","v":2},null,null,null,null,null,null,null,null,null,null,null,null,null,null,null,"Highbreak Finals",null,null,null,null,null,null,{"$f":"IFERROR(Berechnung!BO120,\"\")","v":5},{"$f":"IFERROR(IF(Spieler!$I$2=\"\",\"\",Berechnung!BP120),\"\")","v":"Delling Tino"},{"$f":"IFERROR(IF(Spieler!$S$11=\"SR\",Berechnung!BT120,Berechnung!BQ120),\"\")","v":185.00740000000002},{"$f":"IFERROR(VLOOKUP(AG8,Berechnung!$D$170:$X$209,21,FALSE),\"\")","v":0.77777777777777779},{"$f":"IFERROR(IF(AG8=\"\",\"\",VLOOKUP(AG8,Berechnung!$D$170:$V$209,18,FALSE)),\"\")","v":7},{"$f":"IFERROR(IF(AG8=\"\",\"\",VLOOKUP(AG8,Berechnung!$D$170:$V$209,19,FALSE)),\"\")","v":2}]
[null,null,null,null,null,null,null,null,null,null,null,null,null,null,null,null,"Halbfinale 1","Bo3","Break 30+",null,null,null,null,null,{"$f":"A64","v":64},{"$f":"B64","v":"Weber Marco"},null,null,null,null,null,{"$f":"IFERROR(Berechnung!BO121,\"\")","v":6},{"$f":"IFERROR(IF(Spieler!$I$2=\"\",\"\",Berechnung!BP121),\"\")","v":"Stachly Marec"},{"$f":"IFERROR(IF(Spieler!$S$11=\"SR\",Berechnung!BT121,Berechnung!BQ121),\"\")","v":185.00479999999999},{"$f":"IFERROR(VLOOKUP(AG9,Berechnung!$D$170:$X$209,21,FALSE),\"\")","v":0.7},{"$f":"IFERROR(IF(AG9=\"\",\"\",VLOOKUP(AG9,Berechnung!$D$170:$V$209,18,FALSE)),\"\")","v":7},{"$f":"IFERROR(IF(AG9=\"\",\"\",VLOOKUP(AG9,Berechnung!$D$170:$V$209,19,FALSE)),\"\")","v":3}]
[3,{"$f":"IFERROR(IF(AND($A$1=24,$A$2=\"\"),\"\",IF($A$1>23,VLOOKUP(1,'1. Runde Gruppen'!$N$11:$P$15,3,FALSE),\"\")),\"\")","v":"Witzik Oliver"},0,null,null,null,"Witzik Oliver",null,{"$f":"C11","v":2},null,null,null,null,null,1,null,{"$f":"IFERROR(IF(A1<11,VLOOKUP(1,'1. Runde Gruppen'!$N$3:$P$7,3,FALSE),IF(K6=K7,\"\",IF(K6>K7,J6,J7))),\"\")","v":"Weber Marco"},2,null,null,null,{"$f":"Q10","v":"Weber Marco"},{"$f":"R11","v":0},null,{"$f":"Y52+R52+K52+C52+'2. Runde Gruppen'!Z23+Matches!O83","v":91},"gespielte Frames",null,null,null,null,null,{"$f":"IFERROR(Berechnung!BO122,\"\")","v":7},{"$f":"IFERROR(IF(Spieler!$I$2=\"\",\"\",Berechnung!BP122),\"\")","v":"Gärtner David"},{"$f":"IFERROR(IF(Spieler!$S$11=\"SR\",Berechnung!BT122,Berechnung!BQ122),\"\")","v":180.00639999999999},{"$f":"IFERROR(VLOOKUP(AG10,Berechnung!$D$170:$X$209,21,FALSE),\"\")","v":0.6},{"$f":"IFERROR(IF(AG10=\"\",\"\",VLOOKUP(AG10,Berechnung!$D$170:$V$209,18,FALSE)),\"\")","v":6},{"$f":"IFERROR(IF(AG10=\"\",\"\",VLOOKUP(AG10,Berechnung!$D$170:$V$209,19,FALSE)),\"\")","v":4}]
[null,"Thomas Moritz",2,38,null,null,"Thomas Moritz",null,{"$f":"C10","v":0},null,{"$f":"K5","v":"Bo3"},"Break 30+",null,null,null,null,{"$f":"IFERROR(IF(A1<11,VLOOKUP(2,'1. Runde Gruppen'!$AD$3:$AF$7,3,FALSE),IF(K12=K13,\"\",IF(K12>K13,J12,J13))),\"\")","v":"Müller Marcus"},0,null,null,null,{"$f":"Q11","v":"Müller Marcus"},{"$f":"R10","v":2},null,{"$f":"SUM(Z53+S53+L53+D53+'2. Runde Gruppen'!AJ24+Matches!AD82+Matches!AE82)","v":14},"Breaks 30+",null,null,null,null,null,{"$f":"IFERROR(Berechnung!BO123,\"\")","v":8},{"$f":"IFERROR(IF(Spieler!$I$2=\"\",\"\",Berechnung!BP123),\"\")","v":"Thomas Moritz"},{"$f":"IFERROR(IF(Spieler!$S$11=\"SR\",Berechnung!BT123,Berechnung!BQ123),\"\")","v":175.00399999999999},{"$f":"IFERROR(VLOOKUP(AG11,Berechnung!$D$170:$X$209,21,FALSE),\"\")","v":0.5},{"$f":"IFERROR(IF(AG11=\"\",\"\",VLOOKUP(AG11,Berechnung!$D$170:$V$209,18,FALSE)),\"\")","v":5},{"$f":"IFERROR(IF(AG11=\"\",\"\",VLOOKUP(AG11,Berechnung!$D$170:$V$209,19,FALSE)),\"\")","v":5}]
[null,null,null,null,null,null,null,2,null,{"$f":"IFERROR(IF(AND($A$1=24,$A$2=\"\"),VLOOKUP(1,'2. Runde Gruppen'!N8:P10,3,FALSE),IF(AND(Spieler!AG1=\"X\",Spieler!S12<21),VLOOKUP(1,'1. Runde Gruppen'!AD3:AF7,3,FALSE),IF(AND(A1>11,A1<17),VLOOKUP(1,'1. Runde Gruppen'!$AD$3:$AF$7,3,FALSE),IF(A1=11,VLOOKUP(1,'1. Runde Gruppen'!$AD$3:$AF$7,3,FALSE),IF(AND($A$1>16,$A$1<24),VLOOKUP(1,'2. Runde Gruppen'!$N$8:$P$10,3,FALSE),IF(C10=C11,\"\",IF(C10>C11,B10,B11))))))),\"\")","v":"Thomas Moritz"},0,null,null,null,{"$f":"J12","v":"Thomas Moritz"},{"$f":"K13","v":2},null,null,null,null,null,null,null,null,null,null,null,null,null,null,null,{"$f":"IFERROR(Berechnung!BO124,\"\")","v":9},{"$f":"IFERROR(IF(Spieler!$I$2=\"\",\"\",Berechnung!BP124),\"\")","v":"Straßburger Marko"},{"$f":"IFERROR(IF(Spieler!$S$11=\"SR\",Berechnung!BT124,Berechnung!BQ124),\"\")","v":125.00460000000001},{"$f":"IFERROR(VLOOKUP(AG12,Berechnung!$D$170:$X$209,21,FALSE),\"\")","v":0.55555555555555558},{"$f":"IFERROR(IF(AG12=\"\",\"\",VLOOKUP(AG12,Berechnung!$D$170:$V$209,18,FALSE)),\"\")","v":5},{"$f":"IFERROR(IF(AG12=\"\",\"\",VLOOKUP(AG12,Berechnung!$D$170:$V$209,19,FALSE)),\"\")","v":4}]
[4,{"$f":"IFERROR(IF(AND($A$1=24,$A$2=\"\"),\"\",IF($A$1>23,VLOOKUP(1,'1. Runde Gruppen'!$AD$11:$AF$15,3,FALSE),\"\")),\"\")","v":"Straßburger Marko"},1,null,null,null,"Straßburger Marko",null,{"$f":"C14","v":2},{"$f":"IFERROR(IF(AND($A$1=24,$A$2=\"\"),VLOOKUP(2,'2. Runde Gruppen'!N13:P15,3,FALSE),IF(AND(Spieler!AG1=\"X\",Spieler!S12<21),VLOOKUP(2,'1. Runde Gruppen'!N11:P15,3,FALSE),IF(AND(A1>11,A1<17),VLOOKUP(2,'1. Runde Gruppen'!$N$11:$P$15,3,FALSE),IF(A1=11,VLOOKUP(3,'1. Runde Gruppen'!$N$3:$P$7,3,FALSE),IF(AND($A$1>16,$A$1<24),VLOOKUP(2,'2. Runde Gruppen'!$N$13:$P$15,3,FALSE),IF(C13=C14,\"\",IF(C13>C14,B13,B14))))))),\"\")","v":"Müller Marcus"},2,null,null,null,{"$f":"J13","v":"Müller Marcus"},{"$f":"K12","v":0},null,null,null,null,null,null,null,"Finale","Bo3 / 5","Break 30+",null,null,null,null,null,{"$f":"IFERROR(Berechnung!BO125,\"\")","v":10},{"$f":"IFERROR(IF(Spieler!$I$2=\"\",\"\",Berechnung!BP125),\"\")","v":"Suttner Magnus"},{"$f":"IFERROR(IF(Spieler!$S$11=\"SR\",Berechnung!BT125,Berechnung!BQ125),\"\")","v":120.0044},{"$f":"IFERROR(VLOOKUP(AG13,Berechnung!$D$170:$X$209,21,FALSE),\"\")","v":0.5},{"$f":"IFERROR(IF(AG13=\"\",\"\",VLOOKUP(AG13,Berechnung!$D$170:$V$209,18,FALSE)),\"\")","v":4},{"$f":"IFERROR(IF(AG13=\"\",\"\",VLOOKUP(AG13,Berechnung!$D$170:$V$209,19,FALSE)),\"\")","v":4}]
[null,"Müller Marcus",2,null,null,31,"Müller Marcus",null,{"$f":"C13","v":1},null,null,null,null,null,null,null,null,null,null,null,null,null,null,{"$f":"IF(R10=R11,\"\",IF(R10>R11,Q10,Q11))","v":"Weber Marco"},2,null,null,null,null,{"$f":"Y15","v":0},{"$f":"X14","v":"Weber Marco"},{"$f":"IFERROR(Berechnung!BO126,\"\")","v":11},{"$f":"IFERROR(IF(Spieler!$I$2=\"\",\"\",Berechnung!BP126),\"\")","v":"Valderrama Salvador"},{"$f":"IFERROR(IF(Spieler!$S$11=\"SR\",Berechnung!BT126,Berechnung!BQ126),\"\")","v":120.0038},{"$f":"IFERROR(VLOOKUP(AG14,Berechnung!$D$170:$X$209,21,FALSE),\"\")","v":0.5},{"$f":"IFERROR(IF(AG14=\"\",\"\",VLOOKUP(AG14,Berechnung!$D$170:$V$209,18,FALSE)),\"\")","v":4},{"$f":"IFERROR(IF(AG14=\"\",\"\",VLOOKUP(AG14,Berechnung!$D$170:$V$209,19,FALSE)),\"\")","v":4}]
[null,null,null,null,null,null,null,null,null,null,null,null,null,null,null,null,null,null,null,null,null,null,null,{"$f":"IF(R19=R20,\"\",IF(R19>R20,Q19,Q20))","v":"Jeroch Paul"},0,null,null,null,null,{"$f":"Y14","v":2},{"$f":"X15","v":"Jeroch Paul"},{"$f":"IFERROR(Berechnung!BO127,\"\")","v":12},{"$f":"IFERROR(IF(Spieler!$I$2=\"\",\"\",Berechnung!BP127),\"\")","v":"Witzik Oliver"},{"$f":"IFERROR(IF(Spieler!$S$11=\"SR\",Berechnung!BT127,Berechnung!BQ127),\"\")","v":120.0034},{"$f":"IFERROR(VLOOKUP(AG15,Berechnung!$D$170:$X$209,21,FALSE),\"\")","v":0.66666666666666663},{"$f":"IFERROR(IF(AG15=\"\",\"\",VLOOKUP(AG15,Berechnung!$D$170:$V$209,18,FALSE)),\"\")","v":4},{"$f":"IFERROR(IF(AG15=\"\",\"\",VLOOKUP(AG15,Berechnung!$D$170:$V$209,19,FALSE)),\"\")","v":2}]
[5,"Delling Tino",2,null,null,null,"Delling Tino",null,{"$f":"C17","v":0},null,{"$f":"K5","v":"Bo3"},"Break 30+",null,null,null,null,null,null,null,null,null,null,null,null,null,null,null,null,null,null,null,{"$f":"IFERROR(Berechnung!BO128,\"\")","v":13},{"$f":"IFERROR(IF(Spieler!$I$2=\"\",\"\",Berechnung!BP128),\"\")","v":"Behling Oliver"},{"$f":"IFERROR(IF(Spieler!$S$11=\"SR\",Berechnung!BT128,Berechnung!BQ128),\"\")","v":110.008},{"$f":"IFERROR(VLOOKUP(AG16,Berechnung!$D$170:$X$209,21,FALSE),\"\")","v":0.33333333333333331},{"$f":"IFERROR(IF(AG16=\"\",\"\",VLOOKUP(AG16,Berechnung!$D$170:$V$209,18,FALSE)),\"\")","v":2},{"$f":"IFERROR(IF(AG16=\"\",\"\",VLOOKUP(AG16,Berechnung!$D$170:$V$209,19,FALSE)),\"\")","v":4}]
[null,"Behling Oliver",0,null,null,null,"Behling Oliver",3,{"$f":"C16","v":2},{"$f":"IFERROR(IF(AND($A$1=24,$A$2=\"\"),VLOOKUP(1,'2. Runde Gruppen'!N13:P15,3,FALSE),IF(AND(Spieler!AG1=\"X\",Spieler!S12<21),VLOOKUP(1,'1. Runde Gruppen'!N11:P15,3,FALSE),IF(AND(A1>11,A1<17),VLOOKUP(1,'1. Runde Gruppen'!$N$11:$P$15,3,FALSE),IF(A1=11,VLOOKUP(1,'1. Runde Gruppen'!$N$11:$P$15,3,FALSE),IF(AND($A$1>16,$A$1<24),VLOOKUP(1,'2. Runde Gruppen'!$N$13:$P$15,3,FALSE),IF(C16=C17,\"\",IF(C16>C17,B16,B17))))))),\"\")","v":"Delling Tino"},1,null,null,null,{"$f":"J17","v":"Delling Tino"},{"$f":"K18","v":2},null,null,null,null,null,null,null,null,null,null,null,null,null,null,null,{"$f":"IFERROR(Berechnung!BO129,\"\")","v":14},{"$f":"IFERROR(IF(Spieler!$I$2=\"\",\"\",Berechnung!BP129),\"\")","v":"Drahn Robert"},{"$f":"IFERROR(IF(Spieler!$S$11=\"SR\",Berechnung!BT129,Berechnung!BQ129),\"\")","v":110.0072},{"$f":"IFERROR(VLOOKUP(AG17,Berechnung!$D$170:$X$209,21,FALSE),\"\")","v":0.33333333333333331},{"$f":"IFERROR(IF(AG17=\"\",\"\",VLOOKUP(AG17,Berechnung!$D$170:$V$209,18,FALSE)),\"\")","v":2},{"$f":"IFERROR(IF(AG17=\"\",\"\",VLOOKUP(AG17,Berechnung!$D$170:$V$209,19,FALSE)),\"\")","v":4}]
[null,null,null,null,null,null,null,null,null,{"$f":"IFERROR(IF(AND($A$1=24,$A$2=\"\"),VLOOKUP(2,'2. Runde Gruppen'!N8:P10,3,FALSE),IF(AND(Spieler!AG1=\"X\",Spieler!S12<21),VLOOKUP(2,'1. Runde Gruppen'!AD3:AF7,3,FALSE),IF(AND(A1>11,A1<17),VLOOKUP(2,'1. Runde Gruppen'!$AD$3:$AF$7,3,FALSE),IF(A1=11,VLOOKUP(3,'1. Runde Gruppen'!$AD$3:$AF$7,3,FALSE),IF(AND($A$1>16,$A$1<24),VLOOKUP(2,'2. Runde Gruppen'!$N$8:$P$10,3,FALSE),IF(C19=C20,\"\",IF(C19>C20,B19,B20))))))),\"\")","v":"Jeroch Paul"},2,null,null,null,{"$f":"J18","v":"Jeroch Paul"},{"$f":"K17","v":1},"Halbfinale 2",{"$f":"R9","v":"Bo3"},"Break 30+",null,null,null,null,null,null,null,null,null,null,null,null,{"$f":"IFERROR(Berechnung!BO130,\"\")","v":15},{"$f":"IFERROR(IF(Spieler!$I$2=\"\",\"\",Berechnung!BP130),\"\")","v":"Fandrei Andreas"},{"$f":"IFERROR(IF(Spieler!$S$11=\"SR\",Berechnung!BT130,Berechnung!BQ130),\"\")","v":110.0068},{"$f":"IFERROR(VLOOKUP(AG18,Berechnung!$D$170:$X$209,21,FALSE),\"\")","v":0.33333333333333331},{"$f":"IFERROR(IF(AG18=\"\",\"\",VLOOKUP(AG18,Berechnung!$D$170:$V$209,18,FALSE)),\"\")","v":2},{"$f":"IFERROR(IF(AG18=\"\",\"\",VLOOKUP(AG18,Berechnung!$D$170:$V$209,19,FALSE)),\"\")","v":4}]
[6,{"$f":"IFERROR(IF(AND($A$1=24,$A$2=\"\"),\"\",IF($A$1>23,VLOOKUP(1,'1. Runde Gruppen'!$AD$19:$AF$23,3,FALSE),\"\")),\"\")","v":"Jeroch Paul"},2,null,null,null,"Jeroch Paul",null,{"$f":"C20","v":0},null,null,null,null,null,2,null,{"$f":"IFERROR(IF(A1<11,VLOOKUP(1,'1. Runde Gruppen'!$AD$3:$AF$7,3,FALSE),IF(K17=K18,\"\",IF(K17>K18,J17,J18))),\"\")","v":"Jeroch Paul"},2,null,null,null,{"$f":"Q19","v":"Jeroch Paul"},{"$f":"R20","v":1},null,null,null,null,null,null,null,null,{"$f":"IFERROR(Berechnung!BO131,\"\")","v":16},{"$f":"IFERROR(IF(Spieler!$I$2=\"\",\"\",Berechnung!BP131),\"\")","v":"Hofmann Frank"},{"$f":"IFERROR(IF(Spieler!$S$11=\"SR\",Berechnung!BT131,Berechnung!BQ131),\"\")","v":110.006},{"$f":"IFERROR(VLOOKUP(AG19,Berechnung!$D$170:$X$209,21,FALSE),\"\")","v":0.33333333333333331},{"$f":"IFERROR(IF(AG19=\"\",\"\",VLOOKUP(AG19,Berechnung!$D$170:$V$209,18,FALSE)),\"\")","v":2},{"$f":"IFERROR(IF(AG19=\"\",\"\",VLOOKUP(AG19,Berechnung!$D$170:$V$209,19,FALSE)),\"\")","v":4}]
[null,"Drahn Robert",0,null,null,null,"Drahn Robert",null,{"$f":"C19","v":2},null,null,null,null,null,null,null,{"$f":"IFERROR(IF(A1<11,VLOOKUP(2,'1. Runde Gruppen'!$N$3:$P$7,3,FALSE),IF(K23=K24,\"\",IF(K23>K24,J23,J24))),\"\")","v":"Fandrei Joel"},1,null,null,null,{"$f":"Q20","v":"Fandrei Joel"},{"$f":"R19","v":2},null,null,null,null,null,null,null,null,{"$f":"IFERROR(Berechnung!BO132,\"\")","v":17},{"$f":"IFERROR(IF(Spieler!$I$2=\"\",\"\",Berechnung!BP132),\"\")","v":"Brachmanski Dave"},{"$f":"IFERROR(IF(Spieler!$S$11=\"SR\",Berechnung!BT132,Berechnung!BQ132),\"\")","v":55.007800000000003},{"$f":"IFERROR(VLOOKUP(AG20,Berechnung!$D$170:$X$209,21,FALSE),\"\")","v":0.2},{"$f":"IFERROR(IF(AG20=\"\",\"\",VLOOKUP(AG20,Berechnung!$D$170:$V$209,18,FALSE)),\"\")","v":1},{"$f":"IFERROR(IF(AG20=\"\",\"\",VLOOKUP(AG20,Berechnung!$D$170:$V$209,19,FALSE)),\"\")","v":4}]
[null,null,null,null,null,null,null,null,null,null,null,null,null,null,null,null,null,null,null,null,null,null,null,null,null,null,null,null,null,null,null,{"$f":"IFERROR(Berechnung!BO133,\"\")","v":18},{"$f":"IFERROR(IF(Spieler!$I$2=\"\",\"\",Berechnung!BP133),\"\")","v":"Elham Faiz"},{"$f":"IFERROR(IF(Spieler!$S$11=\"SR\",Berechnung!BT133,Berechnung!BQ133),\"\")","v":55.007000000000005},{"$f":"IFERROR(VLOOKUP(AG21,Berechnung!$D$170:$X$209,21,FALSE),\"\")","v":0.2},{"$f":"IFERROR(IF(AG21=\"\",\"\",VLOOKUP(AG21,Berechnung!$D$170:$V$209,18,FALSE)),\"\")","v":1},{"$f":"IFERROR(IF(AG21=\"\",\"\",VLOOKUP(AG21,Berechnung!$D$170:$V$209,19,FALSE)),\"\")","v":4}]
[7,{"$f":"IFERROR(IF(AND($A$1=24,$A$2=\"\"),\"\",IF($A$1>23,VLOOKUP(1,'1. Runde Gruppen'!$N$27:$P$31,3,FALSE),\"\")),\"\")","v":"Stachly Marec"},2,null,null,null,"Stachly Marec",null,{"$f":"C23","v":1},null,{"$f":"K5","v":"Bo3"},"Break 30+",null,null,null,null,null,null,null,null,null,null,null,"Spiel um Platz 3","Bo1","Break 30+",null,null,null,null,null,{"$f":"IFERROR(Berechnung!BO134,\"\")","v":19},{"$f":"IFERROR(IF(Spieler!$I$2=\"\",\"\",Berechnung!BP134),\"\")","v":"Hartung Andreas"},{"$f":"IFERROR(IF(Spieler!$S$11=\"SR\",Berechnung!BT134,Berechnung!BQ134),\"\")","v":55.006200000000007},{"$f":"IFERROR(VLOOKUP(AG22,Berechnung!$D$170:$X$209,21,FALSE),\"\")","v":0.2},{"$f":"IFERROR(IF(AG22=\"\",\"\",VLOOKUP(AG22,Berechnung!$D$170:$V$209,18,FALSE)),\"\")","v":1},{"$f":"IFERROR(IF(AG22=\"\",\"\",VLOOKUP(AG22,Berechnung!$D$170:$V$209,19,FALSE)),\"\")","v":4}]
[null,"Valderrama Salvador",1,null,null,null,"Valderrama Salvador",4,{"$f":"C22","v":2},{"$f":"IFERROR(IF(AND($A$1=24,$A$2=\"\"),VLOOKUP(1,'2. Runde Gruppen'!N18:P20,3,FALSE),IF(AND(Spieler!AG1=\"X\",Spieler!S12<21),VLOOKUP(1,'1. Runde Gruppen'!AD11:AF15,3,FALSE),IF(AND(A1>11,A1<17),VLOOKUP(1,'1. Runde Gruppen'!$AD$11:$AF$15,3,FALSE),IF(A1=11,VLOOKUP(2,'1. Runde Gruppen'!$N$3:$P$7,3,FALSE),IF(AND($A$1>16,$A$1<24),VLOOKUP(1,'2. Runde Gruppen'!$N$18:$P$20,3,FALSE),IF(C22=C23,\"\",IF(C22>C23,B22,B23))))))),\"\")","v":"Stachly Marec"},1,37,null,null,{"$f":"J23","v":"Stachly Marec"},{"$f":"K24","v":2},null,null,null,null,null,null,null,{"$f":"IF(R10=R11,\"\",IF(R10<R11,Q10,Q11))","v":"Müller Marcus"},0,null,null,null,null,null,{"$f":"X23","v":"Müller Marcus"},{"$f":"IFERROR(Berechnung!BO135,\"\")","v":20},{"$f":"IFERROR(IF(Spieler!$I$2=\"\",\"\",Berechnung!BP135),\"\")","v":"Rejke Ronny"},{"$f":"IFERROR(IF(Spieler!$S$11=\"SR\",Berechnung!BT135,Berechnung!BQ135),\"\")","v":55.004999999999995},{"$f":"IFERROR(VLOOKUP(AG23,Berechnung!$D$170:$X$209,21,FALSE),\"\")","v":0.2},{"$f":"IFERROR(IF(AG23=\"\",\"\",VLOOKUP(AG23,Berechnung!$D$170:$V$209,18,FALSE)),\"\")","v":1},{"$f":"IFERROR(IF(AG23=\"\",\"\",VLOOKUP(AG23,Berechnung!$D$170:$V$209,19,FALSE)),\"\")","v":4}]
[null,null,null,null,null,null,null,null,null,{"$f":"IFERROR(IF(AND($A$1=24,$A$2=\"\"),VLOOKUP(2,'2. Runde Gruppen'!N3:P5,3,FALSE),IF(AND(Spieler!AG1=\"X\",Spieler!S12<21),VLOOKUP(2,'1. Runde Gruppen'!N3:P7,3,FALSE),IF(AND(A1>11,A1<17),VLOOKUP(2,'1. Runde Gruppen'!$N$3:$P$7,3,FALSE),IF(A1=11,VLOOKUP(2,'1. Runde Gruppen'!$AD$3:$AF$7,3,FALSE),IF(AND($A$1>16,$A$1<24),VLOOKUP(2,'2. Runde Gruppen'!$N$3:$P$5,3,FALSE),IF(C25=C26,\"\",IF(C25>C26,B25,B26))))))),\"\")","v":"Fandrei Joel"},2,null,41,45,{"$f":"J24","v":"Fandrei Joel"},{"$f":"K23","v":1},null,null,null,null,null,null,null,{"$f":"IF(R20=R19,\"\",IF(R20>R19,Q19,Q20))","v":"Fandrei Joel"},0,null,null,null,null,null,{"$f":"X24","v":"Fandrei Joel"},{"$f":"IFERROR(Berechnung!BO136,\"\")","v":21},{"$f":"IFERROR(IF(Spieler!$I$2=\"\",\"\",Berechnung!BP136),\"\")","v":"Brömel Frank"},{"$f":"IFERROR(IF(Spieler!$S$11=\"SR\",Berechnung!BT136,Berechnung!BQ136),\"\")","v":50.007599999999996},{"$f":"IFERROR(VLOOKUP(AG24,Berechnung!$D$170:$X$209,21,FALSE),\"\")","v":0},{"$f":"IFERROR(IF(AG24=\"\",\"\",VLOOKUP(AG24,Berechnung!$D$170:$V$209,18,FALSE)),\"\")","v":0},{"$f":"IFERROR(IF(AG24=\"\",\"\",VLOOKUP(AG24,Berechnung!$D$170:$V$209,19,FALSE)),\"\")","v":4}]
[8,{"$f":"IFERROR(IF(AND($A$1=24,$A$2=\"\"),\"\",IF($A$1>23,VLOOKUP(1,'1. Runde Gruppen'!$AD$27:$AF$31,3,FALSE),\"\")),\"\")","v":"Fandrei Joel"},2,null,null,null,"Fandrei Joel",null,{"$f":"C26","v":1},null,null,null,null,null,null,null,"speichert unter C:\\Users\\Public\\Videos",null,null,null,null,null,null,{"$f":"IF(Q25=R26,\"\",IF(Q25>R26,#REF!,Q26))","v":{"$error":"#REF!"}},null,null,null,null,null,null,null,{"$f":"IFERROR(Berechnung!BO137,\"\")","v":22},{"$f":"IFERROR(IF(Spieler!$I$2=\"\",\"\",Berechnung!BP137),\"\")","v":"Isermann Rene"},{"$f":"IFERROR(IF(Spieler!$S$11=\"SR\",Berechnung!BT137,Berechnung!BQ137),\"\")","v":50.005799999999994},{"$f":"IFERROR(VLOOKUP(AG25,Berechnung!$D$170:$X$209,21,FALSE),\"\")","v":0},{"$f":"IFERROR(IF(AG25=\"\",\"\",VLOOKUP(AG25,Berechnung!$D$170:$V$209,18,FALSE)),\"\")","v":0},{"$f":"IFERROR(IF(AG25=\"\",\"\",VLOOKUP(AG25,Berechnung!$D$170:$V$209,19,FALSE)),\"\")","v":4}]
[null,"Suttner Magnus",1,null,null,null,"Suttner Magnus",null,{"$f":"C25","v":2},null,null,null,null,null,null,null,{"$f":"NOW()-TODAY()","v":"12:39:24.400"},null,null,null,null,null,null,null,null,null,null,null,null,null,null,{"$f":"IFERROR(Berechnung!BO138,\"\")","v":23},{"$f":"IFERROR(IF(Spieler!$I$2=\"\",\"\",Berechnung!BP138),\"\")","v":"Löffel Ulrich"},{"$f":"IFERROR(IF(Spieler!$S$11=\"SR\",Berechnung!BT138,Berechnung!BQ138),\"\")","v":50.005399999999995},{"$f":"IFERROR(VLOOKUP(AG26,Berechnung!$D$170:$X$209,21,FALSE),\"\")","v":0},{"$f":"IFERROR(IF(AG26=\"\",\"\",VLOOKUP(AG26,Berechnung!$D$170:$V$209,18,FALSE)),\"\")","v":0},{"$f":"IFERROR(IF(AG26=\"\",\"\",VLOOKUP(AG26,Berechnung!$D$170:$V$209,19,FALSE)),\"\")","v":4}]
[null,null,null,null,null,null,null,null,null,null,null,null,null,null,null,null,null,null,null,null,null,null,null,null,null,null,null,null,null,null,null,{"$f":"IFERROR(Berechnung!BO139,\"\")","v":24},{"$f":"IFERROR(IF(Spieler!$I$2=\"\",\"\",Berechnung!BP139),\"\")","v":"Swennen Andy"},{"$f":"IFERROR(IF(Spieler!$S$11=\"SR\",Berechnung!BT139,Berechnung!BQ139),\"\")","v":50.004199999999997},{"$f":"IFERROR(VLOOKUP(AG27,Berechnung!$D$170:$X$209,21,FALSE),\"\")","v":0},{"$f":"IFERROR(IF(AG27=\"\",\"\",VLOOKUP(AG27,Berechnung!$D$170:$V$209,18,FALSE)),\"\")","v":0},{"$f":"IFERROR(IF(AG27=\"\",\"\",VLOOKUP(AG27,Berechnung!$D$170:$V$209,19,FALSE)),\"\")","v":4}]
[null,null,null,null,null,null,null,null,null,null,null,null,null,null,null,null,null,null,null,null,null,null,null,null,null,null,null,null,null,null,null,{"$f":"IFERROR(Berechnung!BO140,\"\")","v":""},{"$f":"IFERROR(IF(Spieler!$I$2=\"\",\"\",Berechnung!BP140),\"\")","v":""},{"$f":"IFERROR(IF(Spieler!$S$11=\"SR\",Berechnung!BT140,Berechnung!BQ140),\"\")","v":""},{"$f":"IFERROR(VLOOKUP(AG28,Berechnung!$D$170:$X$209,21,FALSE),\"\")","v":""},{"$f":"IFERROR(IF(AG28=\"\",\"\",VLOOKUP(AG28,Berechnung!$D$170:$V$209,18,FALSE)),\"\")","v":""},{"$f":"IFERROR(IF(AG28=\"\",\"\",VLOOKUP(AG28,Berechnung!$D$170:$V$209,19,FALSE)),\"\")","v":""}]
[null,"Next Target: 16.03.2024 - Limbach-O. (6/10)",null,null,null,null,null,null,null,null,null,null,null,null,null,null,null,null,null,null,null,null,null,null,null,null,null,null,null,null,null,{"$f":"IFERROR(Berechnung!BO141,\"\")","v":""},{"$f":"IFERROR(IF(Spieler!$I$2=\"\",\"\",Berechnung!BP141),\"\")","v":""},{"$f":"IFERROR(IF(Spieler!$S$11=\"SR\",Berechnung!BT141,Berechnung!BQ141),\"\")","v":""},{"$f":"IFERROR(VLOOKUP(AG29,Berechnung!$D$170:$X$209,21,FALSE),\"\")","v":""},{"$f":"IFERROR(IF(AG29=\"\",\"\",VLOOKUP(AG29,Berechnung!$D$170:$V$209,18,FALSE)),\"\")","v":""},{"$f":"IFERROR(IF(AG29=\"\",\"\",VLOOKUP(AG29,Berechnung!$D$170:$V$209,19,FALSE)),\"\")","v":""}]
[null,null,null,null,null,null,null,null,null,null,null,null,null,null,null,null,null,null,null,null,null,null,null,null,null,null,null,null,null,null,null,{"$f":"IFERROR(Berechnung!BO142,\"\")","v":""},{"$f":"IFERROR(IF(Spieler!$I$2=\"\",\"\",Berechnung!BP142),\"\")","v":""},{"$f":"IFERROR(IF(Spieler!$S$11=\"SR\",Berechnung!BT142,Berechnung!BQ142),\"\")","v":""},{"$f":"IFERROR(VLOOKUP(AG30,Berechnung!$D$170:$X$209,21,FALSE),\"\")","v":""},{"$f":"IFERROR(IF(AG30=\"\",\"\",VLOOKUP(AG30,Berechnung!$D$170:$V$209,18,FALSE)),\"\")","v":""},{"$f":"IFERROR(IF(AG30=\"\",\"\",VLOOKUP(AG30,Berechnung!$D$170:$V$209,19,FALSE)),\"\")","v":""}]
[null,null,null,null,null,null,null,null,null,null,null,null,null,null,null,null,null,null,null,null,null,null,null,null,null,null,null,null,null,null,null,{"$f":"IFERROR(Berechnung!BO143,\"\")","v":""},{"$f":"IFERROR(IF(Spieler!$I$2=\"\",\"\",Berechnung!BP143),\"\")","v":""},{"$f":"IFERROR(IF(Spieler!$S$11=\"SR\",Berechnung!BT143,Berechnung!BQ143),\"\")","v":""},{"$f":"IFERROR(VLOOKUP(AG31,Berechnung!$D$170:$X$209,21,FALSE),\"\")","v":""},{"$f":"IFERROR(IF(AG31=\"\",\"\",VLOOKUP(AG31,Berechnung!$D$170:$V$209,18,FALSE)),\"\")","v":""},{"$f":"IFERROR(IF(AG31=\"\",\"\",VLOOKUP(AG31,Berechnung!$D$170:$V$209,19,FALSE)),\"\")","v":""}]
[null,null,null,null,null,null,null,null,null,null,null,null,null,null,null,null,null,null,null,null,null,null,null,null,null,null,null,null,null,null,null,{"$f":"IFERROR(Berechnung!BO144,\"\")","v":""},{"$f":"IFERROR(IF(Spieler!$I$2=\"\",\"\",Berechnung!BP144),\"\")","v":""},{"$f":"IFERROR(IF(Spieler!$S$11=\"SR\",Berechnung!BT144,Berechnung!BQ144),\"\")","v":""},{"$f":"IFERROR(VLOOKUP(AG32,Berechnung!$D$170:$X$209,21,FALSE),\"\")","v":""},{"$f":"IFERROR(IF(AG32=\"\",\"\",VLOOKUP(AG32,Berechnung!$D$170:$V$209,18,FALSE)),\"\")","v":""},{"$f":"IFERROR(IF(AG32=\"\",\"\",VLOOKUP(AG32,Berechnung!$D$170:$V$209,19,FALSE)),\"\")","v":""}]
[null,"Infos unter www.saxonian-snooker.de",null,null,null,null,null,null,null,null,null,null,null,null,null,null,null,null,null,null,null,null,null,null,null,null,null,null,null,null,null,{"$f":"IFERROR(Berechnung!BO145,\"\")","v":""},{"$f":"IFERROR(IF(Spieler!$I$2=\"\",\"\",Berechnung!BP145),\"\")","v":""},{"$f":"IFERROR(IF(Spieler!$S$11=\"SR\",Berechnung!BT145,Berechnung!BQ145),\"\")","v":""},{"$f":"IFERROR(VLOOKUP(AG33,Berechnung!$D$170:$X$209,21,FALSE),\"\")","v":""},{"$f":"IFERROR(IF(AG33=\"\",\"\",VLOOKUP(AG33,Berechnung!$D$170:$V$209,18,FALSE)),\"\")","v":""},{"$f":"IFERROR(IF(AG33=\"\",\"\",VLOOKUP(AG33,Berechnung!$D$170:$V$209,19,FALSE)),\"\")","v":""}]
[null,null,null,null,null,null,null,null,null,null,null,null,null,null,null,null,null,null,null,null,null,null,null,null,null,null,null,null,null,null,null,{"$f":"IFERROR(Berechnung!BO146,\"\")","v":""},{"$f":"IFERROR(IF(Spieler!$I$2=\"\",\"\",Berechnung!BP146),\"\")","v":""},{"$f":"IFERROR(IF(Spieler!$S$11=\"SR\",Berechnung!BT146,Berechnung!BQ146),\"\")","v":""},{"$f":"IFERROR(VLOOKUP(AG34,Berechnung!$D$170:$X$209,21,FALSE),\"\")","v":""},{"$f":"IFERROR(IF(AG34=\"\",\"\",VLOOKUP(AG34,Berechnung!$D$170:$V$209,18,FALSE)),\"\")","v":""},{"$f":"IFERROR(IF(AG34=\"\",\"\",VLOOKUP(AG34,Berechnung!$D$170:$V$209,19,FALSE)),\"\")","v":""}]
[null,null,null,null,null,null,null,null,null,null,null,null,null,null,null,null,null,null,null,null,null,null,null,null,null,null,null,null,null,null,null,{"$f":"IFERROR(Berechnung!BO147,\"\")","v":""},{"$f":"IFERROR(IF(Spieler!$I$2=\"\",\"\",Berechnung!BP147),\"\")","v":""},{"$f":"IFERROR(IF(Spieler!$S$11=\"SR\",Berechnung!BT147,Berechnung!BQ147),\"\")","v":""},{"$f":"IFERROR(VLOOKUP(AG35,Berechnung!$D$170:$X$209,21,FALSE),\"\")","v":""},{"$f":"IFERROR(IF(AG35=\"\",\"\",VLOOKUP(AG35,Berechnung!$D$170:$V$209,18,FALSE)),\"\")","v":""},{"$f":"IFERROR(IF(AG35=\"\",\"\",VLOOKUP(AG35,Berechnung!$D$170:$V$209,19,FALSE)),\"\")","v":""}]
[null,null,null,null,null,null,null,null,null,null,null,null,null,null,null,null,null,null,null,null,null,null,null,null,null,null,null,null,null,null,null,{"$f":"IFERROR(Berechnung!BO148,\"\")","v":""},{"$f":"IFERROR(IF(Spieler!$I$2=\"\",\"\",Berechnung!BP148),\"\")","v":""},{"$f":"IFERROR(IF(Spieler!$S$11=\"SR\",Berechnung!BT148,Berechnung!BQ148),\"\")","v":""},{"$f":"IFERROR(VLOOKUP(AG36,Berechnung!$D$170:$X$209,21,FALSE),\"\")","v":""},{"$f":"IFERROR(IF(AG36=\"\",\"\",VLOOKUP(AG36,Berechnung!$D$170:$V$209,18,FALSE)),\"\")","v":""},{"$f":"IFERROR(IF(AG36=\"\",\"\",VLOOKUP(AG36,Berechnung!$D$170:$V$209,19,FALSE)),\"\")","v":""}]
[{"$f":"Matches!AK9","v":148},{"$f":"Matches!Y12","v":true},null,null,null,null,null,null,null,null,null,null,null,null,null,null,null,null,null,null,null,null,null,null,null,null,null,null,null,null,null,{"$f":"IFERROR(Berechnung!BO149,\"\")","v":""},{"$f":"IFERROR(IF(Spieler!$I$2=\"\",\"\",Berechnung!BP149),\"\")","v":""},{"$f":"IFERROR(IF(Spieler!$S$11=\"SR\",Berechnung!BT149,Berechnung!BQ149),\"\")","v":""},{"$f":"IFERROR(VLOOKUP(AG37,Berechnung!$D$170:$X$209,21,FALSE),\"\")","v":""},{"$f":"IFERROR(IF(AG37=\"\",\"\",VLOOKUP(AG37,Berechnung!$D$170:$V$209,18,FALSE)),\"\")","v":""},{"$f":"IFERROR(IF(AG37=\"\",\"\",VLOOKUP(AG37,Berechnung!$D$170:$V$209,19,FALSE)),\"\")","v":""}]
["A2",{"$f":"IFERROR(IF(AND($A$1=24,$A$2=\"X\"),\"\",IF($A$1>23,VLOOKUP(2,'1. Runde Gruppen'!$AD$27:$AF$31,3,FALSE),\"\")),\"\")","v":""},{"$f":"RAND()*100","v":45.778458932607847},{"$f":"B38","v":""},null,null,null,null,null,63.663436315916456,{"$f":"B38","v":""},{"$f":"LARGE($J$38:$J$41,1)","v":97.024270322159111},{"$f":"VLOOKUP(L38,$J$38:$K$41,2,FALSE)","v":""},null,null,null,null,null,null,null,null,null,null,null,null,null,null,null,null,null,null,{"$f":"IFERROR(Berechnung!BO150,\"\")","v":""},{"$f":"IFERROR(IF(Spieler!$I$2=\"\",\"\",Berechnung!BP150),\"\")","v":""},{"$f":"IFERROR(IF(Spieler!$S$11=\"SR\",Berechnung!BT150,Berechnung!BQ150),\"\")","v":""},{"$f":"IFERROR(VLOOKUP(AG38,Berechnung!$D$170:$X$209,21,FALSE),\"\")","v":""},{"$f":"IFERROR(IF(AG38=\"\",\"\",VLOOKUP(AG38,Berechnung!$D$170:$V$209,18,FALSE)),\"\")","v":""},{"$f":"IFERROR(IF(AG38=\"\",\"\",VLOOKUP(AG38,Berechnung!$D$170:$V$209,19,FALSE)),\"\")","v":""}]
["B2",{"$f":"IFERROR(IF($A$1>23,VLOOKUP(2,'1. Runde Gruppen'!$N$27:$P$31,3,FALSE),\"\"),\"\")","v":"Hofmann Frank"},3.1918618193553461,"Hofmann Frank",null,null,null,null,null,74.660427165686514,{"$f":"B39","v":"Hofmann Frank"},{"$f":"LARGE($J$38:$J$41,3)","v":74.660427165686514},{"$f":"VLOOKUP(L39,$J$38:$K$41,2,FALSE)","v":"Hofmann Frank"},null,null,null,null,null,null,null,null,null,null,null,null,null,null,null,null,null,null,{"$f":"IFERROR(Berechnung!BO151,\"\")","v":""},{"$f":"IFERROR(IF(Spieler!$I$2=\"\",\"\",Berechnung!BP151),\"\")","v":""},{"$f":"IFERROR(IF(Spieler!$S$11=\"SR\",Berechnung!BT151,Berechnung!BQ151),\"\")","v":""},{"$f":"IFERROR(VLOOKUP(AG39,Berechnung!$D$170:$X$209,21,FALSE),\"\")","v":""},{"$f":"IFERROR(IF(AG39=\"\",\"\",VLOOKUP(AG39,Berechnung!$D$170:$V$209,18,FALSE)),\"\")","v":""},{"$f":"IFERROR(IF(AG39=\"\",\"\",VLOOKUP(AG39,Berechnung!$D$170:$V$209,19,FALSE)),\"\")","v":""}]
["C2",{"$f":"IFERROR(IF(AND($A$1=24,$A$2=\"X\"),\"\",IF($A$1>23,VLOOKUP(2,'1. Runde Gruppen'!$AD$19:$AF$23,3,FALSE),\"\")),\"\")","v":""},45.862042794513577,"",null,null,null,null,null,84.051827275672778,"",{"$f":"LARGE($J$38:$J$41,4)","v":63.663436315916456},"",null,null,null,null,null,null,null,null,null,null,null,null,null,null,null,null,null,null,{"$f":"IFERROR(Berechnung!BO152,\"\")","v":""},{"$f":"IFERROR(IF(Spieler!$I$2=\"\",\"\",Berechnung!BP152),\"\")","v":""},{"$f":"IFERROR(IF(Spieler!$S$11=\"SR\",Berechnung!BT152,Berechnung!BQ152),\"\")","v":""},{"$f":"IFERROR(VLOOKUP(AG40,Berechnung!$D$170:$X$209,21,FALSE),\"\")","v":""},{"$f":"IFERROR(IF(AG40=\"\",\"\",VLOOKUP(AG40,Berechnung!$D$170:$V$209,18,FALSE)),\"\")","v":""},{"$f":"IFERROR(IF(AG40=\"\",\"\",VLOOKUP(AG40,Berechnung!$D$170:$V$209,19,FALSE)),\"\")","v":""}]
["D2",{"$f":"IFERROR(IF(AND($A$1=24,$A$2=\"X\"),\"\",IF($A$1>23,VLOOKUP(2,'1. Runde Gruppen'!$N$19:$P$23,3,FALSE),\"\")),\"\")","v":""},6.2564285368869932,"",null,null,null,null,null,97.024270322159111,"",{"$f":"LARGE($J$38:$J$41,2)","v":84.051827275672778},"",null,null,null,null,null,null,null,null,null,null,null,null,null,null,null,null,null,null,{"$f":"IFERROR(Berechnung!BO153,\"\")","v":""},{"$f":"IFERROR(IF(Spieler!$I$2=\"\",\"\",Berechnung!BP153),\"\")","v":""},{"$f":"IFERROR(IF(Spieler!$S$11=\"SR\",Berechnung!BT153,Berechnung!BQ153),\"\")","v":""},{"$f":"IFERROR(VLOOKUP(AG41,Berechnung!$D$170:$X$209,21,FALSE),\"\")","v":""},{"$f":"IFERROR(IF(AG41=\"\",\"\",VLOOKUP(AG41,Berechnung!$D$170:$V$209,18,FALSE)),\"\")","v":""},{"$f":"IFERROR(IF(AG41=\"\",\"\",VLOOKUP(AG41,Berechnung!$D$170:$V$209,19,FALSE)),\"\")","v":""}]
["E2",{"$f":"IFERROR(IF(AND($A$1=24,$A$2=\"X\"),\"\",IF($A$1>23,VLOOKUP(2,'1. Runde Gruppen'!$AD$11:$AF$15,3,FALSE),\"\")),\"\")","v":""},14.940498727769869,"",null,null,null,null,null,14.870627605797647,{"$f":"B42","v":""},{"$f":"LARGE($J$42:$J$45,1)","v":98.22855951015454},{"$f":"VLOOKUP(L42,$J$42:$K$45,2,FALSE)","v":""},null,null,null,null,null,null,null,null,null,null,null,null,null,null,null,null,null,null,{"$f":"IFERROR(Berechnung!BO154,\"\")","v":""},{"$f":"IFERROR(IF(Spieler!$I$2=\"\",\"\",Berechnung!BP154),\"\")","v":""},{"$f":"IFERROR(IF(Spieler!$S$11=\"SR\",Berechnung!BT154,Berechnung!BQ154),\"\")","v":""},{"$f":"IFERROR(VLOOKUP(AG42,Berechnung!$D$170:$X$209,21,FALSE),\"\")","v":""},{"$f":"IFERROR(IF(AG42=\"\",\"\",VLOOKUP(AG42,Berechnung!$D$170:$V$209,18,FALSE)),\"\")","v":""},{"$f":"IFERROR(IF(AG42=\"\",\"\",VLOOKUP(AG42,Berechnung!$D$170:$V$209,19,FALSE)),\"\")","v":""}]
["F2",{"$f":"IFERROR(IF(AND($A$1=24,$A$2=\"X\"),\"\",IF($A$1>23,VLOOKUP(2,'1. Runde Gruppen'!$N$11:$P$15,3,FALSE),\"\")),\"\")","v":""},78.878877506035479,"",null,null,null,null,null,98.22855951015454,{"$f":"B43","v":""},{"$f":"LARGE($J$42:$J$45,3)","v":14.870627605797647},{"$f":"VLOOKUP(L43,$J$42:$K$45,2,FALSE)","v":""},null,null,null,null,null,null,null,null,null,null,null,null,null,null,null,null,null,null,{"$f":"IFERROR(Berechnung!BO155,\"\")","v":""},{"$f":"IFERROR(IF(Spieler!$I$2=\"\",\"\",Berechnung!BP155),\"\")","v":""},{"$f":"IFERROR(IF(Spieler!$S$11=\"SR\",Berechnung!BT155,Berechnung!BQ155),\"\")","v":""},{"$f":"IFERROR(VLOOKUP(AG43,Berechnung!$D$170:$X$209,21,FALSE),\"\")","v":""},{"$f":"IFERROR(IF(AG43=\"\",\"\",VLOOKUP(AG43,Berechnung!$D$170:$V$209,18,FALSE)),\"\")","v":""},{"$f":"IFERROR(IF(AG43=\"\",\"\",VLOOKUP(AG43,Berechnung!$D$170:$V$209,19,FALSE)),\"\")","v":""}]
["G2",{"$f":"IFERROR(IF(AND($A$1=24,$A$2=\"X\"),\"\",IF($A$1>23,VLOOKUP(2,'1. Runde Gruppen'!$AD$3:$AF$7,3,FALSE),\"\")),\"\")","v":""},72.010030576891722,"",null,null,null,null,null,94.201156636170666,"",{"$f":"LARGE($J$42:$J$45,4)","v":3.8723828223594658},""]
["H2",{"$f":"IFERROR(IF(AND($A$1=24,$A$2=\"X\"),\"\",IF($A$1>23,VLOOKUP(2,'1. Runde Gruppen'!$N$3:$P$7,3,FALSE),\"\")),\"\")","v":""},29.797406508300327,"",null,null,null,null,null,3.8723828223594658,"",{"$f":"LARGE($J$42:$J$45,2)","v":94.201156636170666},""]
[]
[]
[]
[]
[]
[]
[{"$f":"IFERROR(LARGE(D4:D26,1),\"\")","v":38},{"$f":"VLOOKUP(A52,$D$4:$I$26,4,FALSE)","v":"Thomas Moritz"},{"$f":"SUM(C4:C26)","v":19},{"$f":"IFERROR(LARGE(D4:F26,1),\"\")","v":64},{"$f":"VLOOKUP(D52,E4:I26,4,FALSE)","v":0},{"$f":"VLOOKUP(D52,F4:I26,3,FALSE)","v":{"$error":"#N/A"}},null,null,null,null,{"$f":"SUM(K4:K26)","v":10},{"$f":"IFERROR(LARGE(L4:N26,1),\"\")","v":45},{"$f":"VLOOKUP(L52,M4:P26,4,FALSE)","v":{"$error":"#N/A"}},{"$f":"VLOOKUP(L52,N4:P26,3,FALSE)","v":1},null,null,null,{"$f":"SUM(R4:R26)","v":5},{"$f":"IFERROR(LARGE(S4:U26,1),\"\")","v":""},{"$f":"VLOOKUP(S52,T4:W26,4,FALSE)","v":{"$error":"#N/A"}},{"$f":"VLOOKUP(S52,U4:W26,3,FALSE)","v":{"$error":"#N/A"}},null,null,null,{"$f":"SUM(Y14:Y24)","v":2},{"$f":"IFERROR(LARGE(Z14:AC24,1),\"\")","v":""},{"$f":"VLOOKUP(Z52,AA4:AE26,4,FALSE)","v":{"$error":"#N/A"}},{"$f":"VLOOKUP(AA52,AB4:AE26,4,FALSE)","v":{"$error":"#N/A"}},{"$f":"VLOOKUP(Z52,AC14:AE24,3,FALSE)","v":{"$error":"#N/A"}}]
[{"$f":"IFERROR(LARGE(E4:E26,1),\"\")","v":64},{"$f":"VLOOKUP(A53,E4:I26,3,FALSE)","v":"Weber Marco"},null,{"$f":"COUNT(D4:F26)","v":4},null,null,null,null,null,null,null,{"$f":"COUNT(L4:N26)","v":3},null,null,null,null,null,null,{"$f":"COUNT(S4:U26)","v":0},null,null,null,null,null,null,{"$f":"COUNT(Z14:AC24)","v":0}]
[{"$f":"IFERROR(LARGE(F4:F26,1),\"\")","v":31},{"$f":"VLOOKUP(A54,F4:I26,2,FALSE)","v":"Müller Marcus"},null,{"$f":"Z53+S53+L53+D53","v":7}]
[{"$f":"IFERROR(LARGE(L6:L24,1),\"\")","v":37},{"$f":"VLOOKUP(A55,L6:P24,4,FALSE)","v":"Stachly Marec"},null,{"$f":"IFERROR(LARGE(L6:O24,1),\"\")","v":45}]
[{"$f":"IFERROR(LARGE(M6:M24,1),\"\")","v":41},{"$f":"VLOOKUP(A56,M6:P24,3,FALSE)","v":"Fandrei Joel"},null,{"$f":"IFERROR(VLOOKUP(D52,D4:I26,5,FALSE),\"\")","v":""},null,null,null,null,null,null,null,{"$f":"IFERROR(VLOOKUP(L52,L6:P24,5,FALSE),\"\")","v":""},null,null,null,null,null,null,{"$f":"IFERROR(VLOOKUP(S52,S10:W20,5,FALSE),\"\")","v":""}]
[{"$f":"IFERROR(LARGE(N6:N24,1),\"\")","v":45},{"$f":"VLOOKUP(A57,N6:P24,2,FALSE)","v":"Fandrei Joel"},null,null,null,null,null,null,null,null,null,{"$f":"L52","v":45},null,null,null,null,null,null,{"$f":"S52","v":""},null,null,null,null,null,null,{"$f":"Z52","v":""}]
[{"$f":"IFERROR(LARGE(S10:S20,1),\"\")","v":""},{"$f":"VLOOKUP(A58,S10:W20,4,FALSE)","v":{"$error":"#N/A"}},null,{"$f":"LARGE(S10:V20,1)","v":{"$error":"#NUM!"}},null,null,null,null,null,null,null,{"$f":"L52","v":45}]
[{"$f":"IFERROR(LARGE(T10:T20,1),\"\")","v":""},{"$f":"VLOOKUP(A59,T10:W20,3,FALSE)","v":{"$error":"#N/A"}}]
[{"$f":"IFERROR(LARGE(U10:U20,1),\"\")","v":""},{"$f":"VLOOKUP(A60,U10:W20,2,FALSE)","v":{"$error":"#N/A"}}]
[{"$f":"IFERROR(LARGE(Z14:Z24,1),\"\")","v":""},{"$f":"VLOOKUP(A61,Z14:AE24,5,FALSE)","v":{"$error":"#N/A"}}]
[{"$f":"IFERROR(LARGE(AA14:AA24,1),\"\")","v":""},{"$f":"VLOOKUP(A62,AA14:AE24,4,FALSE)","v":{"$error":"#N/A"}}]
[{"$f":"IFERROR(LARGE(AC14:AC24,1),\"\")","v":""},{"$f":"VLOOKUP(A63,AC14:AE24,3,FALSE)","v":{"$error":"#N/A"}}]
[{"$f":"IFERROR(LARGE(A52:A63,1),\"\")","v":64},{"$f":"IFERROR(VLOOKUP(A64,A52:B63,2,FALSE),\"\")","v":"Weber Marco"},null,{"$f":"LARGE(D52:D63,1)","v":{"$error":"#NUM!"}}]