{"text_format":"1","workbook":"xlsx","n_sheets":3,"sheets":["Mannschaften","Spielplan","Spielplan Import"],"not_rendered":{"charts":0,"images":0,"macros":1,"external_links":0,"defined_names":0,"comments":0,"pivot_tables":0},"unopened":[],"bounds":{"document_bytes":16777216,"sheet_cells":100000,"rows_first":2000,"rows_last":500,"rows_between":2000,"halvings":0,"cell_chars":16384,"cell_head_chars":4096},"cells_cut":0,"cells_raw":0,"read":"whole","date_system":"1900"}

{"sheet":"Mannschaften","index":0,"n_rows":100,"n_cols":16,"rows_kept":100,"cut":false,"hidden":false,"merged":[[80,7,80,9],[87,7,87,9],[94,7,94,9],[94,11,94,13],[87,11,87,13],[80,11,80,13],[0,0,0,1],[73,11,73,13],[66,11,66,13],[59,11,59,13],[52,11,52,13],[12,3,12,4],[12,5,12,6],[52,7,52,9],[59,7,59,9],[66,7,66,9],[73,7,73,9],[35,3,35,4],[35,5,35,6]]}
["Oberliga Snooker - Spielplan",null,null,null,null,null,{"$f":"LARGE(A3:A10,1)","v":8},null,null,null,null,null,null,null,{"$f":"G1","v":8},"Meldungen"]
[{"$f":"LARGE(A3:A10,1)","v":8},null,null,null,null,null,null,null,null,null,null,null,null,null,"  bei 5 oder 7 Meldungen bitte noch \"spielfrei\" eintragen"]
[1,"Limbach-Oberfrohna 3",{"$f":"IF(B3=\"\",2222222222222220000,RAND()*123)","v":34.268560334490424},null,null,null,null,null,1,2,3,4,5,6,"   PW: 147"]
[2,"Hohenstein",49.439808442678107,null,null,null,null,1,"x"]
[3,"Limbach-Oberfrohna 2",84.053804375933268,null,null,null,null,2,null,"x"]
[4,"spielfrei",107.7452691373586,null,null,null,null,3,null,null,"x"]
[{"$f":"IF(B7=\"\",\"\",5)","v":5},"Leipzig 1",71.318245644306103,null,null,null,null,4,null,null,null,"x"]
[{"$f":"IF(B8=\"\",\"\",6)","v":6},"SaxMax Dresden 2",104.28154690004878,null,null,null,null,5,null,null,null,null,"x"]
[{"$f":"IF(B9=\"\",\"\",7)","v":7},"Snoobi Dresden",59.026476269889073,null,null,null,null,6,null,null,null,null,null,"x"]
[{"$f":"IF(B10=\"\",\"\",8)","v":8},"Limbach-Oberfrohna 1",30.304134586152895]
[]
[null,null,null,6]
[null,null,null,"Hinrunde",null,"Rückrunde"]
[null,null,null,1,6,{"$f":"E14","v":6},{"$f":"D14","v":1}]
[null,null,null,2,5,{"$f":"E15","v":5},{"$f":"D15","v":2}]
[null,null,null,3,4,4,3]
[]
[null,null,null,6,2,2,{"$f":"D18","v":6}]
[null,null,null,3,1,1,3]
[null,null,null,4,5,5,4]
[null,null,null,null,null,null,0]
[null,null,null,3,6,6,3]
[null,null,null,4,2,2,4]
[null,null,null,5,1,1,5]
[]
[null,null,null,6,4,4,6]
[null,null,null,5,3,3,5]
[null,null,null,1,2,2,1]
[]
[null,null,null,5,6,6,5]
[null,null,null,1,4,4,1]
[null,null,null,2,3,3,2]
[]
[]
[null,null,null,8]
[null,null,null,"Hinrunde",null,"Rückrunde"]
[null,null,null,1,8,{"$f":"E37","v":8},{"$f":"D37","v":1}]
[null,null,null,2,7,{"$f":"E38","v":7},{"$f":"D38","v":2}]
[null,null,null,6,3,3,6]
[null,null,null,4,5,5,4]
[null,null,null,8,2,{"$f":"E41","v":2},{"$f":"D41","v":8}]
[null,null,null,3,1,1,3]
[null,null,null,7,4,4,7]
[null,null,null,5,6,6,5]
[null,null,null,8,4,{"$f":"E45","v":4},8]
[null,null,null,5,3,3,5]
[null,null,null,6,2,2,6]
[null,null,null,7,1,1,7]
[null,null,null,3,8,{"$f":"E49","v":8},{"$f":"D49","v":3}]
[null,null,null,4,2,2,4]
[null,null,null,1,5,5,1]
[null,null,null,6,7,7,6]
[null,null,null,5,8,{"$f":"E53","v":8},{"$f":"D53","v":5},"1. Spieltag",null,null,null,{"$f":"IF($G$1<8,\"6. Spieltag\",\"8. Spieltag\")","v":"8. Spieltag"}]
[null,null,null,6,4,4,6,"Heim",null,"Gast",null,"Heim",null,"Gast"]
[{"$f":"IF(OR(H55=0,J55=0),1,0)","v":0},null,null,3,7,7,3,{"$f":"IFERROR(IF(G1<6,0,IF($G$1=6,VLOOKUP(D14,$A$3:$B$10,2,FALSE),IF($G$1=8,VLOOKUP(D37,$A$3:$B$10,2,FALSE)))),\"\")","v":"Limbach-Oberfrohna 3"},"v",{"$f":"IFERROR(IF(G1<6,0,IF($G$1=6,VLOOKUP(E14,$A$3:$B$10,2,FALSE),IF($G$1=8,VLOOKUP(E37,$A$3:$B$10,2,FALSE)))),\"\")","v":"Limbach-Oberfrohna 1"},null,{"$f":"J55","v":"Limbach-Oberfrohna 1"},"v",{"$f":"H55","v":"Limbach-Oberfrohna 3"}]
[{"$f":"IF(OR(H56=0,J56=0),1,0)","v":0},null,null,1,2,2,1,{"$f":"IFERROR(IF(G1<6,0,IF($G$1=6,VLOOKUP(D15,$A$3:$B$10,2,FALSE),IF($G$1=8,VLOOKUP(D38,$A$3:$B$10,2,FALSE)))),\"\")","v":"Hohenstein"},"v",{"$f":"IFERROR(IF(G1<6,0,IF($G$1=6,VLOOKUP(E15,$A$3:$B$10,2,FALSE),IF($G$1=8,VLOOKUP(E38,$A$3:$B$10,2,FALSE)))),\"\")","v":"Snoobi Dresden"},null,{"$f":"J56","v":"Snoobi Dresden"},"v",{"$f":"H56","v":"Hohenstein"}]
[0,null,null,8,6,6,8,{"$f":"IFERROR(IF(G1<6,0,IF($G$1=6,VLOOKUP(D16,$A$3:$B$10,2,FALSE),IF($G$1=8,VLOOKUP(D39,$A$3:$B$10,2,FALSE)))),\"\")","v":"SaxMax Dresden 2"},"v",{"$f":"IFERROR(IF(G1<6,0,IF($G$1=6,VLOOKUP(E16,$A$3:$B$10,2,FALSE),IF($G$1=8,VLOOKUP(E39,$A$3:$B$10,2,FALSE)))),\"\")","v":"Limbach-Oberfrohna 2"},null,"Limbach-Oberfrohna 2","v","SaxMax Dresden 2"]
[0,null,null,7,5,5,7,{"$f":"IFERROR(IF(G1<6,0,IF($G$1=6,VLOOKUP(D17,$A$3:$B$10,2,FALSE),IF($G$1=8,VLOOKUP(D40,$A$3:$B$10,2,FALSE)))),\"\")","v":"spielfrei"},"v",{"$f":"IFERROR(IF(G1<6,0,IF($G$1=6,VLOOKUP(E17,$A$3:$B$10,2,FALSE),IF($G$1=8,VLOOKUP(E40,$A$3:$B$10,2,FALSE)))),\"\")","v":"Leipzig 1"},null,"Leipzig 1","v","spielfrei"]
[null,null,null,4,1,1,4]
[null,null,null,2,3,3,2,"2. Spieltag",null,null,null,{"$f":"IF($G$1<8,\"7. Spieltag\",\"9. Spieltag\")","v":"9. Spieltag"}]
[null,null,null,7,8,8,7,"Heim",null,"Gast",null,"Heim",null,"Gast"]
[0,null,null,1,6,6,1,{"$f":"IFERROR(IF(G1<6,0,IF($G$1=6,VLOOKUP(D18,$A$3:$B$10,2,FALSE),IF($G$1=8,VLOOKUP(D41,$A$3:$B$10,2,FALSE)))),\"\")","v":"Limbach-Oberfrohna 1"},"v",{"$f":"IFERROR(IF(G1<6,0,IF($G$1=6,VLOOKUP(E18,$A$3:$B$10,2,FALSE),IF($G$1=8,VLOOKUP(E41,$A$3:$B$10,2,FALSE)))),\"\")","v":"Hohenstein"},null,{"$f":"J62","v":"Hohenstein"},"v",{"$f":"H62","v":"Limbach-Oberfrohna 1"}]
[0,null,null,5,2,2,5,{"$f":"IFERROR(IF(G1<6,0,IF($G$1=6,VLOOKUP(D19,$A$3:$B$10,2,FALSE),IF($G$1=8,VLOOKUP(D42,$A$3:$B$10,2,FALSE)))),\"\")","v":"Limbach-Oberfrohna 2"},"v",{"$f":"IFERROR(IF(G1<6,0,IF($G$1=6,VLOOKUP(E19,$A$3:$B$10,2,FALSE),IF($G$1=8,VLOOKUP(E42,$A$3:$B$10,2,FALSE)))),\"\")","v":"Limbach-Oberfrohna 3"},null,{"$f":"J63","v":"Limbach-Oberfrohna 3"},"v",{"$f":"H63","v":"Limbach-Oberfrohna 2"}]
[0,null,null,3,4,4,3,{"$f":"IFERROR(IF(G1<6,0,IF($G$1=6,VLOOKUP(D20,$A$3:$B$10,2,FALSE),IF($G$1=8,VLOOKUP(D43,$A$3:$B$10,2,FALSE)))),\"\")","v":"Snoobi Dresden"},"v",{"$f":"IFERROR(IF(G1<6,0,IF($G$1=6,VLOOKUP(E20,$A$3:$B$10,2,FALSE),IF($G$1=8,VLOOKUP(E43,$A$3:$B$10,2,FALSE)))),\"\")","v":"spielfrei"},null,"spielfrei","v","Snoobi Dresden"]
[0,null,null,null,null,null,null,{"$f":"IFERROR(IF(G1<6,0,IF($G$1=6,VLOOKUP(D21,$A$3:$B$10,2,FALSE),IF($G$1=8,VLOOKUP(D44,$A$3:$B$10,2,FALSE)))),\"\")","v":"Leipzig 1"},"v",{"$f":"IFERROR(IF(G1<6,0,IF($G$1=6,VLOOKUP(E21,$A$3:$B$10,2,FALSE),IF($G$1=8,VLOOKUP(E44,$A$3:$B$10,2,FALSE)))),\"\")","v":"SaxMax Dresden 2"},null,"SaxMax Dresden 2","v","Leipzig 1"]
[]
[null,null,null,null,null,null,null,"3. Spieltag",null,null,null,{"$f":"IF($G$1<8,\"8. Spieltag\",\"10. Spieltag\")","v":"10. Spieltag"}]
[null,null,null,null,null,null,null,"Heim",null,"Gast",null,"Heim",null,"Gast"]
[0,null,null,null,null,null,null,{"$f":"IFERROR(IF(G1<6,0,IF($G$1=6,VLOOKUP(D22,$A$3:$B$10,2,FALSE),IF($G$1=8,VLOOKUP(D45,$A$3:$B$10,2,FALSE)))),\"\")","v":"Limbach-Oberfrohna 1"},"v",{"$f":"IFERROR(IF(G1<6,0,IF($G$1=6,VLOOKUP(E22,$A$3:$B$10,2,FALSE),IF($G$1=8,VLOOKUP(E45,$A$3:$B$10,2,FALSE)))),\"\")","v":"spielfrei"},null,{"$f":"J69","v":"spielfrei"},"v",{"$f":"H69","v":"Limbach-Oberfrohna 1"}]
[0,null,null,null,null,null,null,{"$f":"IFERROR(IF(G1<6,0,IF($G$1=6,VLOOKUP(D23,$A$3:$B$10,2,FALSE),IF($G$1=8,VLOOKUP(D46,$A$3:$B$10,2,FALSE)))),\"\")","v":"Leipzig 1"},"v",{"$f":"IFERROR(IF(G1<6,0,IF($G$1=6,VLOOKUP(E23,$A$3:$B$10,2,FALSE),IF($G$1=8,VLOOKUP(E46,$A$3:$B$10,2,FALSE)))),\"\")","v":"Limbach-Oberfrohna 2"},null,{"$f":"J70","v":"Limbach-Oberfrohna 2"},"v",{"$f":"H70","v":"Leipzig 1"}]
[0,null,null,null,null,null,null,{"$f":"IFERROR(IF(G1<6,0,IF($G$1=6,VLOOKUP(D24,$A$3:$B$10,2,FALSE),IF($G$1=8,VLOOKUP(D47,$A$3:$B$10,2,FALSE)))),\"\")","v":"SaxMax Dresden 2"},"v",{"$f":"IFERROR(IF(G1<6,0,IF($G$1=6,VLOOKUP(E24,$A$3:$B$10,2,FALSE),IF($G$1=8,VLOOKUP(E47,$A$3:$B$10,2,FALSE)))),\"\")","v":"Hohenstein"},null,"Hohenstein","v","SaxMax Dresden 2"]
[0,null,null,null,null,null,null,{"$f":"IFERROR(IF(G1<6,0,IF($G$1=6,VLOOKUP(D25,$A$3:$B$10,2,FALSE),IF($G$1=8,VLOOKUP(D48,$A$3:$B$10,2,FALSE)))),\"\")","v":"Snoobi Dresden"},"v",{"$f":"IFERROR(IF(G1<6,0,IF($G$1=6,VLOOKUP(E25,$A$3:$B$10,2,FALSE),IF($G$1=8,VLOOKUP(E48,$A$3:$B$10,2,FALSE)))),\"\")","v":"Limbach-Oberfrohna 3"},null,"Limbach-Oberfrohna 3","v","Snoobi Dresden"]
[]
[null,null,null,null,null,null,null,"4. Spieltag",null,null,null,{"$f":"IF($G$1<8,\"9. Spieltag\",\"11. Spieltag\")","v":"11. Spieltag"}]
[null,null,null,null,null,null,null,"Heim",null,"Gast",null,"Heim",null,"Gast"]
[0,null,null,null,null,null,null,{"$f":"IFERROR(IF(G1<6,0,IF($G$1=6,VLOOKUP(D26,$A$3:$B$10,2,FALSE),IF($G$1=8,VLOOKUP(D49,$A$3:$B$10,2,FALSE)))),\"\")","v":"Limbach-Oberfrohna 2"},"v",{"$f":"IFERROR(IF(G1<6,0,IF($G$1=6,VLOOKUP(E26,$A$3:$B$10,2,FALSE),IF($G$1=8,VLOOKUP(E49,$A$3:$B$10,2,FALSE)))),\"\")","v":"Limbach-Oberfrohna 1"},null,{"$f":"J76","v":"Limbach-Oberfrohna 1"},"v",{"$f":"H76","v":"Limbach-Oberfrohna 2"}]
[0,null,null,null,null,null,null,{"$f":"IFERROR(IF(G1<6,0,IF($G$1=6,VLOOKUP(D27,$A$3:$B$10,2,FALSE),IF($G$1=8,VLOOKUP(D50,$A$3:$B$10,2,FALSE)))),\"\")","v":"spielfrei"},"v",{"$f":"IFERROR(IF(G1<6,0,IF($G$1=6,VLOOKUP(E27,$A$3:$B$10,2,FALSE),IF($G$1=8,VLOOKUP(E50,$A$3:$B$10,2,FALSE)))),\"\")","v":"Hohenstein"},null,{"$f":"J77","v":"Hohenstein"},"v",{"$f":"H77","v":"spielfrei"}]
[0,null,null,null,null,null,null,{"$f":"IFERROR(IF(G1<6,0,IF($G$1=6,VLOOKUP(D28,$A$3:$B$10,2,FALSE),IF($G$1=8,VLOOKUP(D51,$A$3:$B$10,2,FALSE)))),\"\")","v":"Limbach-Oberfrohna 3"},"v",{"$f":"IFERROR(IF(G1<6,0,IF($G$1=6,VLOOKUP(E28,$A$3:$B$10,2,FALSE),IF($G$1=8,VLOOKUP(E51,$A$3:$B$10,2,FALSE)))),\"\")","v":"Leipzig 1"},null,"Leipzig 1","v","Limbach-Oberfrohna 3"]
[0,null,null,null,null,null,null,{"$f":"IFERROR(IF(G1<6,0,IF($G$1=6,VLOOKUP(D29,$A$3:$B$10,2,FALSE),IF($G$1=8,VLOOKUP(D52,$A$3:$B$10,2,FALSE)))),\"\")","v":"SaxMax Dresden 2"},"v",{"$f":"IFERROR(IF(G1<6,0,IF($G$1=6,VLOOKUP(E29,$A$3:$B$10,2,FALSE),IF($G$1=8,VLOOKUP(E52,$A$3:$B$10,2,FALSE)))),\"\")","v":"Snoobi Dresden"},null,"Snoobi Dresden","v","SaxMax Dresden 2"]
[]
[null,null,null,null,null,null,null,"5. Spieltag",null,null,null,{"$f":"IF($G$1<8,\"10. Spieltag\",\"12. Spieltag\")","v":"12. Spieltag"}]
[null,null,null,null,null,null,null,"Heim",null,"Gast",null,"Heim",null,"Gast"]
[0,null,null,null,null,null,null,{"$f":"IFERROR(IF(G1<6,0,IF($G$1=6,VLOOKUP(D30,$A$3:$B$10,2,FALSE),IF($G$1=8,VLOOKUP(D53,$A$3:$B$10,2,FALSE)))),\"\")","v":"Leipzig 1"},"v",{"$f":"IFERROR(IF(G1<6,0,IF($G$1=6,VLOOKUP(E30,$A$3:$B$10,2,FALSE),IF($G$1=8,VLOOKUP(E53,$A$3:$B$10,2,FALSE)))),\"\")","v":"Limbach-Oberfrohna 1"},null,{"$f":"J83","v":"Limbach-Oberfrohna 1"},"v",{"$f":"H83","v":"Leipzig 1"}]
[0,null,null,null,null,null,null,{"$f":"IFERROR(IF(G1<6,0,IF($G$1=6,VLOOKUP(D31,$A$3:$B$10,2,FALSE),IF($G$1=8,VLOOKUP(D54,$A$3:$B$10,2,FALSE)))),\"\")","v":"SaxMax Dresden 2"},"v",{"$f":"IFERROR(IF(G1<6,0,IF($G$1=6,VLOOKUP(E31,$A$3:$B$10,2,FALSE),IF($G$1=8,VLOOKUP(E54,$A$3:$B$10,2,FALSE)))),\"\")","v":"spielfrei"},null,{"$f":"J84","v":"spielfrei"},"v",{"$f":"H84","v":"SaxMax Dresden 2"}]
[0,null,null,null,null,null,null,{"$f":"IFERROR(IF(G1<6,0,IF($G$1=6,VLOOKUP(D32,$A$3:$B$10,2,FALSE),IF($G$1=8,VLOOKUP(D55,$A$3:$B$10,2,FALSE)))),\"\")","v":"Limbach-Oberfrohna 2"},"v",{"$f":"IFERROR(IF(G1<6,0,IF($G$1=6,VLOOKUP(E32,$A$3:$B$10,2,FALSE),IF($G$1=8,VLOOKUP(E55,$A$3:$B$10,2,FALSE)))),\"\")","v":"Snoobi Dresden"},null,"Snoobi Dresden","v","Limbach-Oberfrohna 2"]
[0,null,null,null,null,null,null,{"$f":"IFERROR(IF(G1<6,0,IF($G$1=6,VLOOKUP(D33,$A$3:$B$10,2,FALSE),IF($G$1=8,VLOOKUP(D56,$A$3:$B$10,2,FALSE)))),\"\")","v":"Limbach-Oberfrohna 3"},"v",{"$f":"IFERROR(IF(G1<6,0,IF($G$1=6,VLOOKUP(E33,$A$3:$B$10,2,FALSE),IF($G$1=8,VLOOKUP(E56,$A$3:$B$10,2,FALSE)))),\"\")","v":"Hohenstein"},null,"Hohenstein","v","Limbach-Oberfrohna 3"]
[]
[null,null,null,null,null,null,null,{"$f":"IF($G$1<8,\"\",\"6. Spieltag\")","v":"6. Spieltag"},null,null,null,{"$f":"IF($G$1<8,\"\",\"13. Spieltag\")","v":"13. Spieltag"}]
[null,null,null,null,null,null,null,"Heim",null,"Gast",null,"Heim",null,"Gast"]
[0,null,null,null,null,null,null,{"$f":"IFERROR(IF($G$1=8,VLOOKUP(D57,$A$3:$B$10,2,FALSE)),\"\")","v":"Limbach-Oberfrohna 1"},"v",{"$f":"IFERROR(IF($G$1=8,VLOOKUP(E57,$A$3:$B$10,2,FALSE)),\"\")","v":"SaxMax Dresden 2"},null,{"$f":"J90","v":"SaxMax Dresden 2"},"v",{"$f":"H90","v":"Limbach-Oberfrohna 1"}]
[0,null,null,null,null,null,null,{"$f":"IFERROR(IF($G$1=8,VLOOKUP(D58,$A$3:$B$10,2,FALSE)),\"\")","v":"Snoobi Dresden"},"v",{"$f":"IFERROR(IF($G$1=8,VLOOKUP(E58,$A$3:$B$10,2,FALSE)),\"\")","v":"Leipzig 1"},null,{"$f":"J91","v":"Leipzig 1"},"v",{"$f":"H91","v":"Snoobi Dresden"}]
[0,null,null,null,null,null,null,"spielfrei","v","Limbach-Oberfrohna 3",null,"Limbach-Oberfrohna 3","v","spielfrei"]
[0,null,null,null,null,null,null,"Hohenstein","v","Limbach-Oberfrohna 2",null,"Limbach-Oberfrohna 2","v","Hohenstein"]
[]
[null,null,null,null,null,null,null,{"$f":"IF($G$1<8,\"\",\"7. Spieltag\")","v":"7. Spieltag"},null,null,null,{"$f":"IF($G$1<8,\"\",\"14. Spieltag\")","v":"14. Spieltag"}]
[null,null,null,null,null,null,null,"Heim",null,"Gast",null,"Heim",null,"Gast"]
[0,null,null,null,null,null,null,{"$f":"IFERROR(IF($G$1=8,VLOOKUP(D61,$A$3:$B$10,2,FALSE)),\"\")","v":"Snoobi Dresden"},"v",{"$f":"IFERROR(IF($G$1=8,VLOOKUP(E61,$A$3:$B$10,2,FALSE)),\"\")","v":"Limbach-Oberfrohna 1"},null,{"$f":"J97","v":"Limbach-Oberfrohna 1"},"v",{"$f":"H97","v":"Snoobi Dresden"}]
[0,null,null,null,null,null,null,{"$f":"IFERROR(IF($G$1=8,VLOOKUP(D62,$A$3:$B$10,2,FALSE)),\"\")","v":"Limbach-Oberfrohna 3"},"v",{"$f":"IFERROR(IF($G$1=8,VLOOKUP(E62,$A$3:$B$10,2,FALSE)),\"\")","v":"SaxMax Dresden 2"},null,{"$f":"J98","v":"SaxMax Dresden 2"},"v",{"$f":"H98","v":"Limbach-Oberfrohna 3"}]
[0,null,null,null,null,null,null,"Leipzig 1","v","Hohenstein",null,"Hohenstein","v","Leipzig 1"]
[0,null,null,null,null,null,null,"Limbach-Oberfrohna 2","v","spielfrei",null,"spielfrei","v","Limbach-Oberfrohna 2"]

{"sheet":"Spielplan","index":1,"n_rows":50,"n_cols":8,"rows_kept":50,"cut":false,"hidden":false,"merged":[[1,5,1,7],[44,1,44,3],[44,5,44,7],[37,1,37,3],[37,5,37,7],[0,1,0,7],[23,1,23,3],[23,5,23,7],[30,1,30,3],[30,5,30,7],[2,1,2,3],[2,5,2,7],[9,1,9,3],[9,5,9,7],[16,1,16,3],[16,5,16,7],[1,1,1,3]]}
[null,"Spielplan Oberliga - Saison 2021 / 2022\nBei Doppelspieltagen beginnt der Spieltag bereits 11:00 Uhr!"]
[1,"Hinrunde",null,null,null,"Rückrunde"]
[1,"1. Spieltag 04.09.2021",null,null,null,{"$f":"IF(Mannschaften!$O$1>6,\"8. Spieltag 09.01.2022\",\"6. Spieltag 12.12.2021\")","v":"8. Spieltag 09.01.2022"}]
[1,"Heim",null,"Gast",null,"Heim",null,"Gast"]
[{"$f":"IF(OR(B5=\"\",D5=\"\"),0,IF(OR(B5=0,D5=0),0,1))","v":1},{"$f":"Mannschaften!H55","v":"Limbach-Oberfrohna 3"},"v",{"$f":"Mannschaften!J55","v":"Limbach-Oberfrohna 1"},null,{"$f":"Mannschaften!L55","v":"Limbach-Oberfrohna 1"},"v",{"$f":"Mannschaften!N55","v":"Limbach-Oberfrohna 3"}]
[{"$f":"IF(OR(B6=\"\",D6=\"\"),0,IF(OR(B6=0,D6=0),0,1))","v":1},{"$f":"Mannschaften!H56","v":"Hohenstein"},"v",{"$f":"Mannschaften!J56","v":"Snoobi Dresden"},null,{"$f":"Mannschaften!L56","v":"Snoobi Dresden"},"v",{"$f":"Mannschaften!N56","v":"Hohenstein"}]
[1,{"$f":"Mannschaften!H57","v":"SaxMax Dresden 2"},"v",{"$f":"Mannschaften!J57","v":"Limbach-Oberfrohna 2"},null,{"$f":"Mannschaften!L57","v":"Limbach-Oberfrohna 2"},"v",{"$f":"Mannschaften!N57","v":"SaxMax Dresden 2"}]
[1,{"$f":"Mannschaften!H58","v":"spielfrei"},"v",{"$f":"Mannschaften!J58","v":"Leipzig 1"},null,{"$f":"Mannschaften!L58","v":"Leipzig 1"},"v",{"$f":"Mannschaften!N58","v":"spielfrei"}]
[1]
[1,"2. Spieltag 05.09.2021",null,null,null,{"$f":"IF(Mannschaften!$O$1>6,\"9. Spieltag 12.02.2022\",\"7. Spieltag 13.12.2021\")","v":"9. Spieltag 12.02.2022"}]
[1,"Heim",null,"Gast",null,"Heim",null,"Gast"]
[1,{"$f":"Mannschaften!H62","v":"Limbach-Oberfrohna 1"},"v",{"$f":"Mannschaften!J62","v":"Hohenstein"},null,{"$f":"Mannschaften!L62","v":"Hohenstein"},"v",{"$f":"Mannschaften!N62","v":"Limbach-Oberfrohna 1"}]
[1,{"$f":"Mannschaften!H63","v":"Limbach-Oberfrohna 2"},"v",{"$f":"Mannschaften!J63","v":"Limbach-Oberfrohna 3"},null,{"$f":"Mannschaften!L63","v":"Limbach-Oberfrohna 3"},"v",{"$f":"Mannschaften!N63","v":"Limbach-Oberfrohna 2"}]
[1,{"$f":"Mannschaften!H64","v":"Snoobi Dresden"},"v",{"$f":"Mannschaften!J64","v":"spielfrei"},null,{"$f":"Mannschaften!L64","v":"spielfrei"},"v",{"$f":"Mannschaften!N64","v":"Snoobi Dresden"}]
[1,{"$f":"Mannschaften!H65","v":"Leipzig 1"},"v",{"$f":"Mannschaften!J65","v":"SaxMax Dresden 2"},null,{"$f":"Mannschaften!L65","v":"SaxMax Dresden 2"},"v",{"$f":"Mannschaften!N65","v":"Leipzig 1"}]
[1]
[1,"3. Spieltag 09.10.2021",null,null,null,{"$f":"IF(Mannschaften!$O$1>6,\"10. Spieltag 13.02.2022\",\"8. Spieltag 07.03.2021\")","v":"10. Spieltag 13.02.2022"}]
[1,"Heim",null,"Gast",null,"Heim",null,"Gast"]
[1,{"$f":"Mannschaften!H69","v":"Limbach-Oberfrohna 1"},{"$f":"Mannschaften!I69","v":"v"},{"$f":"Mannschaften!J69","v":"spielfrei"},null,{"$f":"Mannschaften!L69","v":"spielfrei"},{"$f":"Mannschaften!M69","v":"v"},{"$f":"Mannschaften!N69","v":"Limbach-Oberfrohna 1"}]
[1,{"$f":"Mannschaften!H70","v":"Leipzig 1"},{"$f":"Mannschaften!I70","v":"v"},{"$f":"Mannschaften!J70","v":"Limbach-Oberfrohna 2"},null,{"$f":"Mannschaften!L70","v":"Limbach-Oberfrohna 2"},{"$f":"Mannschaften!M70","v":"v"},{"$f":"Mannschaften!N70","v":"Leipzig 1"}]
[1,{"$f":"Mannschaften!H71","v":"SaxMax Dresden 2"},{"$f":"Mannschaften!I71","v":"v"},{"$f":"Mannschaften!J71","v":"Hohenstein"},null,{"$f":"Mannschaften!L71","v":"Hohenstein"},{"$f":"Mannschaften!M71","v":"v"},{"$f":"Mannschaften!N71","v":"SaxMax Dresden 2"}]
[1,{"$f":"Mannschaften!H72","v":"Snoobi Dresden"},{"$f":"Mannschaften!I72","v":"v"},{"$f":"Mannschaften!J72","v":"Limbach-Oberfrohna 3"},null,{"$f":"Mannschaften!L72","v":"Limbach-Oberfrohna 3"},{"$f":"Mannschaften!M72","v":"v"},{"$f":"Mannschaften!N72","v":"Snoobi Dresden"}]
[1]
[1,"4. Spieltag 10.10.2021",null,null,null,{"$f":"IF(Mannschaften!$O$1>6,\"11. Spieltag 05.03.2022\",\"9. Spieltag 07.03.2021\")","v":"11. Spieltag 05.03.2022"}]
[1,"Heim",null,"Gast",null,"Heim",null,"Gast"]
[1,{"$f":"Mannschaften!H76","v":"Limbach-Oberfrohna 2"},{"$f":"Mannschaften!I76","v":"v"},{"$f":"Mannschaften!J76","v":"Limbach-Oberfrohna 1"},null,{"$f":"Mannschaften!L76","v":"Limbach-Oberfrohna 1"},{"$f":"Mannschaften!M76","v":"v"},{"$f":"Mannschaften!N76","v":"Limbach-Oberfrohna 2"}]
[1,{"$f":"Mannschaften!H77","v":"spielfrei"},{"$f":"Mannschaften!I77","v":"v"},{"$f":"Mannschaften!J77","v":"Hohenstein"},null,{"$f":"Mannschaften!L77","v":"Hohenstein"},{"$f":"Mannschaften!M77","v":"v"},{"$f":"Mannschaften!N77","v":"spielfrei"}]
[1,{"$f":"Mannschaften!H78","v":"Limbach-Oberfrohna 3"},{"$f":"Mannschaften!I78","v":"v"},{"$f":"Mannschaften!J78","v":"Leipzig 1"},null,{"$f":"Mannschaften!L78","v":"Leipzig 1"},{"$f":"Mannschaften!M78","v":"v"},{"$f":"Mannschaften!N78","v":"Limbach-Oberfrohna 3"}]
[1,{"$f":"Mannschaften!H79","v":"SaxMax Dresden 2"},{"$f":"Mannschaften!I79","v":"v"},{"$f":"Mannschaften!J79","v":"Snoobi Dresden"},null,{"$f":"Mannschaften!L79","v":"Snoobi Dresden"},{"$f":"Mannschaften!M79","v":"v"},{"$f":"Mannschaften!N79","v":"SaxMax Dresden 2"}]
[1]
[1,"5. Spieltag 13.11.2021",null,null,null,{"$f":"IF(Mannschaften!$O$1>6,\"12. Spieltag 06.03.2022\",\"10. Spieltag 07.03.2021\")","v":"12. Spieltag 06.03.2022"}]
[1,"Heim",null,"Gast",null,"Heim",null,"Gast"]
[1,{"$f":"Mannschaften!J83","v":"Limbach-Oberfrohna 1"},{"$f":"Mannschaften!I83","v":"v"},{"$f":"Mannschaften!H83","v":"Leipzig 1"},null,{"$f":"Mannschaften!N83","v":"Leipzig 1"},{"$f":"Mannschaften!M83","v":"v"},{"$f":"Mannschaften!L83","v":"Limbach-Oberfrohna 1"}]
[1,{"$f":"Mannschaften!H84","v":"SaxMax Dresden 2"},{"$f":"Mannschaften!I84","v":"v"},{"$f":"Mannschaften!J84","v":"spielfrei"},null,{"$f":"Mannschaften!L84","v":"spielfrei"},{"$f":"Mannschaften!M84","v":"v"},{"$f":"Mannschaften!N84","v":"SaxMax Dresden 2"}]
[1,{"$f":"Mannschaften!H85","v":"Limbach-Oberfrohna 2"},{"$f":"Mannschaften!I85","v":"v"},{"$f":"Mannschaften!J85","v":"Snoobi Dresden"},null,{"$f":"Mannschaften!L85","v":"Snoobi Dresden"},{"$f":"Mannschaften!M85","v":"v"},{"$f":"Mannschaften!N85","v":"Limbach-Oberfrohna 2"}]
[1,{"$f":"Mannschaften!J86","v":"Hohenstein"},{"$f":"Mannschaften!I86","v":"v"},{"$f":"Mannschaften!H86","v":"Limbach-Oberfrohna 3"},null,{"$f":"Mannschaften!N86","v":"Limbach-Oberfrohna 3"},{"$f":"Mannschaften!M86","v":"v"},{"$f":"Mannschaften!L86","v":"Hohenstein"}]
[{"$f":"IF(Mannschaften!$O$1>6,1,0)","v":1}]
[{"$f":"IF(Mannschaften!$O$1>6,1,0)","v":1},"6. Spieltag 14.11.2021",null,null,null,{"$f":"IF(Mannschaften!$O$1>6,\"13. Spieltag 30.04.2022\",\"12.Spieltag07.03.2021\")","v":"13. Spieltag 30.04.2022"}]
[{"$f":"IF(Mannschaften!$O$1>6,1,0)","v":1},"Heim",null,"Gast",null,"Heim",null,"Gast"]
[{"$f":"IF(OR(B40=\"\",D40=\"\"),0,IF(OR(B40=0,D40=0),0,1))","v":1},{"$f":"Mannschaften!H90","v":"Limbach-Oberfrohna 1"},{"$f":"Mannschaften!I90","v":"v"},{"$f":"Mannschaften!J90","v":"SaxMax Dresden 2"},null,{"$f":"Mannschaften!L90","v":"SaxMax Dresden 2"},{"$f":"Mannschaften!M90","v":"v"},{"$f":"Mannschaften!N90","v":"Limbach-Oberfrohna 1"}]
[1,{"$f":"Mannschaften!H91","v":"Snoobi Dresden"},{"$f":"Mannschaften!I91","v":"v"},{"$f":"Mannschaften!J91","v":"Leipzig 1"},null,{"$f":"Mannschaften!L91","v":"Leipzig 1"},{"$f":"Mannschaften!M91","v":"v"},{"$f":"Mannschaften!N91","v":"Snoobi Dresden"}]
[1,{"$f":"Mannschaften!H92","v":"spielfrei"},{"$f":"Mannschaften!I92","v":"v"},{"$f":"Mannschaften!J92","v":"Limbach-Oberfrohna 3"},null,{"$f":"Mannschaften!L92","v":"Limbach-Oberfrohna 3"},{"$f":"Mannschaften!M92","v":"v"},{"$f":"Mannschaften!N92","v":"spielfrei"}]
[1,{"$f":"Mannschaften!H93","v":"Hohenstein"},{"$f":"Mannschaften!I93","v":"v"},{"$f":"Mannschaften!J93","v":"Limbach-Oberfrohna 2"},null,{"$f":"Mannschaften!L93","v":"Limbach-Oberfrohna 2"},{"$f":"Mannschaften!M93","v":"v"},{"$f":"Mannschaften!N93","v":"Hohenstein"}]
[{"$f":"IF(Mannschaften!$O$1>6,1,0)","v":1}]
[{"$f":"IF(Mannschaften!$O$1>6,1,0)","v":1},"7. Spieltag 08.01.2022",null,null,null,{"$f":"IF(Mannschaften!$O$1>6,\"14. Spieltag 01.05.2022\",\"13.Spieltag07.03.2021\")","v":"14. Spieltag 01.05.2022"}]
[{"$f":"IF(Mannschaften!$O$1>6,1,0)","v":1},"Heim",null,"Gast",null,"Heim",null,"Gast"]
[{"$f":"IF(OR(B47=\"\",D47=\"\"),0,IF(OR(B47=0,D47=0),0,1))","v":1},{"$f":"Mannschaften!H97","v":"Snoobi Dresden"},{"$f":"Mannschaften!I97","v":"v"},{"$f":"Mannschaften!J97","v":"Limbach-Oberfrohna 1"},null,{"$f":"Mannschaften!L97","v":"Limbach-Oberfrohna 1"},{"$f":"Mannschaften!M97","v":"v"},{"$f":"Mannschaften!N97","v":"Snoobi Dresden"}]
[1,{"$f":"Mannschaften!H98","v":"Limbach-Oberfrohna 3"},{"$f":"Mannschaften!I98","v":"v"},{"$f":"Mannschaften!J98","v":"SaxMax Dresden 2"},null,{"$f":"Mannschaften!L98","v":"SaxMax Dresden 2"},{"$f":"Mannschaften!M98","v":"v"},{"$f":"Mannschaften!N98","v":"Limbach-Oberfrohna 3"}]
[1,{"$f":"Mannschaften!H99","v":"Leipzig 1"},{"$f":"Mannschaften!I99","v":"v"},{"$f":"Mannschaften!J99","v":"Hohenstein"},null,{"$f":"Mannschaften!L99","v":"Hohenstein"},{"$f":"Mannschaften!M99","v":"v"},{"$f":"Mannschaften!N99","v":"Leipzig 1"}]
[1,{"$f":"Mannschaften!H100","v":"Limbach-Oberfrohna 2"},{"$f":"Mannschaften!I100","v":"v"},{"$f":"Mannschaften!J100","v":"spielfrei"},null,{"$f":"Mannschaften!L100","v":"spielfrei"},{"$f":"Mannschaften!M100","v":"v"},{"$f":"Mannschaften!N100","v":"Limbach-Oberfrohna 2"}]

{"sheet":"Spielplan Import","index":2,"n_rows":94,"n_cols":8,"rows_kept":94,"cut":false,"hidden":false,"merged":[]}
["Spieltag","Runde","Datum","Heimmannschaft","Gegner","Gastgeber","Zeit"]
[1,1,"2021-09-04",{"$f":"Spielplan!B5","v":"Limbach-Oberfrohna 3"},{"$f":"Spielplan!D5","v":"Limbach-Oberfrohna 1"},{"$f":"D2","v":"Limbach-Oberfrohna 3"},"12:00:00",{"$f":"IF(D2=\"\",\"X\",IF(D2=FALSE,\"X\",\"\"))","v":""}]
[1,1,"2021-09-04",{"$f":"Spielplan!B6","v":"Hohenstein"},{"$f":"Spielplan!D6","v":"Snoobi Dresden"},{"$f":"D3","v":"Hohenstein"},"11:00:00",""]
[1,1,"2021-09-04",{"$f":"Spielplan!B7","v":"SaxMax Dresden 2"},{"$f":"Spielplan!D7","v":"Limbach-Oberfrohna 2"},{"$f":"D4","v":"SaxMax Dresden 2"},"12:00:00",""]
[1,1,"2021-09-04",{"$f":"Spielplan!B8","v":"spielfrei"},{"$f":"Spielplan!D8","v":"Leipzig 1"},{"$f":"D5","v":"spielfrei"},"-",{"$f":"IF(D5=\"\",\"X\",IF(D5=FALSE,\"X\",\"\"))","v":""}]
[]
[null,null,null,null,null,{"$f":"D7","v":0},null,{"$f":"IF(D7=\"\",\"X\",IF(D7=FALSE,\"X\",\"\"))","v":"X"}]
[null,null,null,null,null,0,null,"X"]
[2,1,"2021-09-05",{"$f":"Spielplan!B12","v":"Limbach-Oberfrohna 1"},{"$f":"Spielplan!D12","v":"Hohenstein"},"Limbach-Oberfrohna 1","11:00:00",""]
[2,1,"2021-09-05",{"$f":"Spielplan!B13","v":"Limbach-Oberfrohna 2"},{"$f":"Spielplan!D13","v":"Limbach-Oberfrohna 3"},"Limbach-Oberfrohna 2","11:00:00",""]
[2,1,"2021-09-05",{"$f":"Spielplan!B14","v":"Snoobi Dresden"},{"$f":"Spielplan!D14","v":"spielfrei"},"Snoobi Dresden","-",""]
[2,1,"2021-09-05",{"$f":"Spielplan!B15","v":"Leipzig 1"},{"$f":"Spielplan!D15","v":"SaxMax Dresden 2"},"Leipzig 1","12:00:00",""]
[]
[null,null,null,null,null,{"$f":"D14","v":0},null,"X"]
[null,null,null,null,null,0,null,"X"]
[3,1,"2021-10-09",{"$f":"Spielplan!B19","v":"Limbach-Oberfrohna 1"},{"$f":"Spielplan!D19","v":"spielfrei"},"Limbach-Oberfrohna 1","-",""]
[3,1,{"$f":"C16","v":"2021-10-09"},{"$f":"Spielplan!B20","v":"Leipzig 1"},{"$f":"Spielplan!D20","v":"Limbach-Oberfrohna 2"},"Leipzig 1","11:00:00",""]
[3,1,{"$f":"C16","v":"2021-10-09"},{"$f":"Spielplan!B21","v":"SaxMax Dresden 2"},{"$f":"Spielplan!D21","v":"Hohenstein"},"SaxMax Dresden 2","11:00:00",""]
[3,1,{"$f":"C16","v":"2021-10-09"},{"$f":"Spielplan!B22","v":"Snoobi Dresden"},{"$f":"Spielplan!D22","v":"Limbach-Oberfrohna 3"},"Snoobi Dresden","12:00:00",""]
[]
[null,null,null,null,null,{"$f":"D21","v":0},null,"X"]
[null,null,null,null,null,0,null,"X"]
[4,1,"2021-10-10",{"$f":"Spielplan!B26","v":"Limbach-Oberfrohna 2"},{"$f":"Spielplan!D26","v":"Limbach-Oberfrohna 1"},"Limbach-Oberfrohna 2","-",""]
[4,1,{"$f":"C23","v":"2021-10-10"},{"$f":"Spielplan!B27","v":"spielfrei"},{"$f":"Spielplan!D27","v":"Hohenstein"},"spielfrei","12:00:00",""]
[4,1,{"$f":"C23","v":"2021-10-10"},{"$f":"Spielplan!B28","v":"Limbach-Oberfrohna 3"},{"$f":"Spielplan!D28","v":"Leipzig 1"},"Limbach-Oberfrohna 3","11:00:00",""]
[4,1,{"$f":"C23","v":"2021-10-10"},{"$f":"Spielplan!B29","v":"SaxMax Dresden 2"},{"$f":"Spielplan!D29","v":"Snoobi Dresden"},"SaxMax Dresden 2","12:00:00",""]
[]
[null,null,null,null,null,{"$f":"D28","v":0},"15:00:00","X"]
[null,null,null,null,null,0,"16:00:00","X"]
[5,1,"2021-11-13",{"$f":"Spielplan!B33","v":"Limbach-Oberfrohna 1"},{"$f":"Spielplan!D33","v":"Leipzig 1"},"Limbach-Oberfrohna 1","11:00:00",""]
[5,1,"2021-11-13",{"$f":"Spielplan!B34","v":"SaxMax Dresden 2"},{"$f":"Spielplan!D34","v":"spielfrei"},"SaxMax Dresden 2","-",""]
[5,1,"2021-11-13",{"$f":"Spielplan!B35","v":"Limbach-Oberfrohna 2"},{"$f":"Spielplan!D35","v":"Snoobi Dresden"},"Limbach-Oberfrohna 2","11:00:00",""]
[5,1,"2021-11-13",{"$f":"Spielplan!B36","v":"Hohenstein"},{"$f":"Spielplan!D36","v":"Limbach-Oberfrohna 3"},"Hohenstein","11:00:00",""]
[]
[null,null,null,null,null,{"$f":"D35","v":0},"22:00:00","X"]
[null,null,null,null,null,0,"23:00:00","X"]
[6,1,"2021-11-14",{"$f":"Spielplan!B40","v":"Limbach-Oberfrohna 1"},{"$f":"Spielplan!D40","v":"SaxMax Dresden 2"},"Limbach-Oberfrohna 1","12:00:00",""]
[6,1,"2021-11-14",{"$f":"Spielplan!B41","v":"Snoobi Dresden"},{"$f":"Spielplan!D41","v":"Leipzig 1"},"Snoobi Dresden","12:00:00",""]
[6,1,"2021-11-14",{"$f":"Spielplan!B42","v":"spielfrei"},{"$f":"Spielplan!D42","v":"Limbach-Oberfrohna 3"},"spielfrei","-",""]
[6,1,"2021-11-14",{"$f":"Spielplan!B43","v":"Hohenstein"},{"$f":"Spielplan!D43","v":"Limbach-Oberfrohna 2"},"Hohenstein","11:00:00",""]
[]
[null,null,null,null,null,{"$f":"D42","v":0},1.2083333333333299,"X"]
[null,null,null,null,null,0,1.25,"X"]
[7,1,"2021-12-11",{"$f":"Spielplan!B47","v":"Snoobi Dresden"},{"$f":"Spielplan!D47","v":"Limbach-Oberfrohna 1"},"Snoobi Dresden","12:00:00",""]
[7,1,"2021-12-11",{"$f":"Spielplan!B48","v":"Limbach-Oberfrohna 3"},{"$f":"Spielplan!D48","v":"SaxMax Dresden 2"},"Limbach-Oberfrohna 3","12:00:00",""]
[7,1,"2021-12-11",{"$f":"Spielplan!B49","v":"Leipzig 1"},{"$f":"Spielplan!D49","v":"Hohenstein"},"Leipzig 1","12:00:00",""]
[7,1,"2021-12-11",{"$f":"Spielplan!B50","v":"Limbach-Oberfrohna 2"},{"$f":"Spielplan!D50","v":"spielfrei"},"Limbach-Oberfrohna 2","-",""]
[]
[8,2,"2021-12-12",{"$f":"Spielplan!F5","v":"Limbach-Oberfrohna 1"},{"$f":"Spielplan!H5","v":"Limbach-Oberfrohna 3"},{"$f":"D49","v":"Limbach-Oberfrohna 1"},"11:00:00",""]
[8,2,"2021-12-12",{"$f":"Spielplan!F6","v":"Snoobi Dresden"},{"$f":"Spielplan!H6","v":"Hohenstein"},{"$f":"D50","v":"Snoobi Dresden"},"12:00:00",""]
[8,2,"2021-12-12",{"$f":"Spielplan!F7","v":"Limbach-Oberfrohna 2"},{"$f":"Spielplan!H7","v":"SaxMax Dresden 2"},{"$f":"D51","v":"Limbach-Oberfrohna 2"},"11:00:00",""]
[8,2,"2021-12-12",{"$f":"Spielplan!F8","v":"Leipzig 1"},{"$f":"Spielplan!H8","v":"spielfrei"},{"$f":"D52","v":"Leipzig 1"},"-",""]
[]
[null,null,null,null,null,null,null,"X"]
[null,null,null,null,null,null,null,"X"]
[9,2,"2022-01-08",{"$f":"Spielplan!F12","v":"Hohenstein"},{"$f":"Spielplan!H12","v":"Limbach-Oberfrohna 1"},{"$f":"D56","v":"Hohenstein"},"11:00:00",""]
[9,2,"2022-01-08",{"$f":"Spielplan!F13","v":"Limbach-Oberfrohna 3"},{"$f":"Spielplan!H13","v":"Limbach-Oberfrohna 2"},"Limbach-Oberfrohna 3","12:00:00",""]
[9,2,"2022-01-08",{"$f":"Spielplan!F14","v":"spielfrei"},{"$f":"Spielplan!H14","v":"Snoobi Dresden"},"spielfrei","-",""]
[9,2,"2022-01-08",{"$f":"Spielplan!F15","v":"SaxMax Dresden 2"},{"$f":"Spielplan!H15","v":"Leipzig 1"},"SaxMax Dresden 2","12:00:00",""]
[]
[null,null,null,null,null,null,null,"X"]
[null,null,null,null,null,null,null,"X"]
[10,2,"2022-01-09",{"$f":"Spielplan!F19","v":"spielfrei"},{"$f":"Spielplan!H19","v":"Limbach-Oberfrohna 1"},{"$f":"D63","v":"spielfrei"},"-",""]
[10,2,"2022-01-09",{"$f":"Spielplan!F20","v":"Limbach-Oberfrohna 2"},{"$f":"Spielplan!H20","v":"Leipzig 1"},"Limbach-Oberfrohna 2","12:00:00",""]
[10,2,"2022-01-09",{"$f":"Spielplan!F21","v":"Hohenstein"},{"$f":"Spielplan!H21","v":"SaxMax Dresden 2"},"Hohenstein","12:00:00",""]
[10,2,"2022-01-09",{"$f":"Spielplan!F22","v":"Limbach-Oberfrohna 3"},{"$f":"Spielplan!H22","v":"Snoobi Dresden"},"Limbach-Oberfrohna 3","12:00:00",""]
[]
[null,null,null,null,null,null,null,"X"]
[null,null,null,null,null,null,null,"X"]
[11,2,"2022-02-12",{"$f":"Spielplan!F26","v":"Limbach-Oberfrohna 1"},{"$f":"Spielplan!H26","v":"Limbach-Oberfrohna 2"},{"$f":"D70","v":"Limbach-Oberfrohna 1"},"12:00:00",{"$f":"IF(D70=\"\",\"X\",IF(D70=FALSE,\"X\",\"\"))","v":""}]
[11,2,"2022-02-12",{"$f":"Spielplan!F27","v":"Hohenstein"},{"$f":"Spielplan!H27","v":"spielfrei"},"Hohenstein","-",""]
[11,2,"2022-02-12",{"$f":"Spielplan!F28","v":"Leipzig 1"},{"$f":"Spielplan!H28","v":"Limbach-Oberfrohna 3"},"Leipzig 1","12:00:00",""]
[11,2,"2022-02-12",{"$f":"Spielplan!F29","v":"Snoobi Dresden"},{"$f":"Spielplan!H29","v":"SaxMax Dresden 2"},"Snoobi Dresden","11:00:00",""]
[]
[null,null,null,null,null,null,"15:00:00","X"]
[null,null,null,null,null,null,"16:00:00","X"]
[12,2,"2022-02-13",{"$f":"Spielplan!F33","v":"Leipzig 1"},{"$f":"Spielplan!H33","v":"Limbach-Oberfrohna 1"},{"$f":"D77","v":"Leipzig 1"},"12:00:00",""]
[12,2,"2022-02-13",{"$f":"Spielplan!F34","v":"spielfrei"},{"$f":"Spielplan!H34","v":"SaxMax Dresden 2"},"spielfrei","-",""]
[12,2,"2022-02-13",{"$f":"Spielplan!F35","v":"Snoobi Dresden"},{"$f":"Spielplan!H35","v":"Limbach-Oberfrohna 2"},"Snoobi Dresden","12:00:00",""]
[12,2,"2022-02-13",{"$f":"Spielplan!F36","v":"Limbach-Oberfrohna 3"},{"$f":"Spielplan!H36","v":"Hohenstein"},"Limbach-Oberfrohna 3","12:00:00",""]
[]
[null,null,null,null,null,null,"22:00:00","X"]
[null,null,null,null,null,null,"23:00:00","X"]
[13,2,"2022-03-05",{"$f":"Spielplan!F40","v":"SaxMax Dresden 2"},{"$f":"Spielplan!H40","v":"Limbach-Oberfrohna 1"},{"$f":"D84","v":"SaxMax Dresden 2"},"12:00:00",""]
[13,2,"2022-03-05",{"$f":"Spielplan!F41","v":"Leipzig 1"},{"$f":"Spielplan!H41","v":"Snoobi Dresden"},"Leipzig 1","12:00:00",""]
[13,2,"2022-03-05",{"$f":"Spielplan!F42","v":"Limbach-Oberfrohna 3"},{"$f":"Spielplan!H42","v":"spielfrei"},"Limbach-Oberfrohna 3","-",""]
[13,2,"2022-03-05",{"$f":"Spielplan!F43","v":"Limbach-Oberfrohna 2"},{"$f":"Spielplan!H43","v":"Hohenstein"},"Limbach-Oberfrohna 2","12:00:00",""]
[]
[null,null,null,null,null,null,1.2083333333333299,"X"]
[null,null,null,null,null,null,1.25,"X"]
[14,2,"2022-03-06",{"$f":"Spielplan!F47","v":"Limbach-Oberfrohna 1"},{"$f":"Spielplan!H47","v":"Snoobi Dresden"},{"$f":"D91","v":"Limbach-Oberfrohna 1"},"12:00:00",""]
[14,2,"2022-03-06",{"$f":"Spielplan!F48","v":"SaxMax Dresden 2"},{"$f":"Spielplan!H48","v":"Limbach-Oberfrohna 3"},"SaxMax Dresden 2","12:00:00",""]
[14,2,"2022-03-06",{"$f":"Spielplan!F49","v":"Hohenstein"},{"$f":"Spielplan!H49","v":"Leipzig 1"},"Hohenstein","11:00:00",""]
[14,2,"2022-03-06",{"$f":"Spielplan!F50","v":"spielfrei"},{"$f":"Spielplan!H50","v":"Limbach-Oberfrohna 2"},"spielfrei","-",""]